program: Orca
programVersion: 5.0.2
elementType: S S P O O O O C C C C C C H H H H H H H H H H H H H H H
charge: 0
multiplicity: 1
keywords: wb97x-d3
keywords: def2-TZVPP
keywords: def2/J RIJCOSX
keywords: DEFGRID2
keywords: scfconv7
keywords: smallprint printgap noloewdin
keywords: NOSOSCF
formula: C6H15O4PS2
InChI: InChI=1/C6H15O4PS2/c1-4-13(8)6-5-12-11(7,9-2)10-3/h4-6H2,1-3H3
28 atoms
S  -2.382729 0.364138 0.30672
S  0.808327 -0.081164 1.018737
P  2.059429 0.005479 -0.656446
O  3.357549 -0.853959 -0.328352
O  2.619588 1.501128 -0.526766
O  -2.861155 -0.153444 1.631926
O  1.417716 -0.385687 -1.920794
C  -1.408256 -0.988494 -0.442318
C  -0.328146 -1.424894 0.522812
C  -3.804418 0.286059 -0.847916
C  -4.721992 -0.888392 -0.575832
C  4.150598 -0.651707 0.832639
C  1.783648 2.590666 -0.905814
H  -2.0687 -1.835362 -0.640512
H  -0.984093 -0.636771 -1.382448
H  -0.77395 -1.764221 1.457553
H  0.240619 -2.25334 0.103995
H  -4.335924 1.228378 -0.704838
H  -3.404393 0.289313 -1.864114
H  -5.618432 -0.808512 -1.190042
H  -4.252629 -1.844205 -0.804505
H  -5.025941 -0.904563 0.468668
H  3.541334 -0.653566 1.739045
H  4.705343 0.284945 0.77386
H  4.854248 -1.479175 0.881688
H  1.574498 2.569563 -1.975185
H  2.322144 3.503077 -0.663273
H  0.839989 2.579929 -0.35601
totalener: -1676.47841430 hartree
nucrepener: 1298.68967366 hartree
electener: -2975.16808796 hartree
oneelecener: -4892.45361400 hartree
twoeener: 1917.28552604 hartree
kineticenergy: 1671.92471175 hartree
xcener: -105.496374194325 hartree
chargesum: -0.0000000
charge: 0.462649 -0.187904 0.797392 -0.311981 -0.333405 -0.574292 -0.519974 -0.213552 -0.132477 -0.143584 -0.255806 -0.124117 -0.121370 0.114788 0.129067 0.141621 0.121720 0.108887 0.092530 0.091676 0.074897 0.108893 0.103361 0.116070 0.117584 0.121984 0.116280 0.099065
qa: 0.4626 -0.1879 0.7974 -0.3120 -0.3334 -0.5743 -0.5200 -0.2136 -0.1325 -0.1436 -0.2558 -0.1241 -0.1214 0.1148 0.1291 0.1416 0.1217 0.1089 0.0925 0.0917 0.0749 0.1089 0.1034 0.1161 0.1176 0.1220 0.1163 0.0991
va: 3.6025 2.2492 5.5223 2.1334 2.0859 1.8274 2.1002 3.9418 3.9210 3.8899 3.9443 3.8709 3.8768 1.0179 1.0424 1.0234 1.0149 1.0054 1.0199 1.0028 1.0042 1.0208 0.9997 0.9904 0.9904 0.9920 0.9926 0.9995
dispcorr: -0.011540329 hartree
energy: -1676.489954632903
dipole: -10.95453 11.20221 0.24768 -1.43132 1.76749 0.33617 -2.43974 2.05801 -0.38173
magnitude: 0.56575 au
magnitude: 1.43802 debye
