program: Orca
programVersion: 5.0.2
elementType: S S P O O O O C C C C C C H H H H H H H H H H H H H H H
charge: 0
multiplicity: 1
keywords: wb97x-d3
keywords: def2-TZVPP
keywords: def2/J RIJCOSX
keywords: DEFGRID2
keywords: scfconv7
keywords: smallprint printgap noloewdin
keywords: NOSOSCF
formula: C6H15O4PS2
InChI: InChI=1/C6H15O4PS2/c1-4-13(8)6-5-12-11(7,9-2)10-3/h4-6H2,1-3H3
28 atoms
S  -3.152853 -0.388317 0.230652
S  0.462995 0.068918 1.142192
P  1.64713 0.54486 -0.509573
O  2.687646 -0.672321 -0.493086
O  2.577563 1.767233 -0.102053
O  -3.427899 -0.194481 1.69318
O  0.887778 0.791896 -1.745016
C  -1.905987 0.87342 -0.223938
C  -0.941367 1.214215 0.891336
C  -2.179467 -1.924467 0.085001
C  -1.657123 -2.181253 -1.315461
C  2.297898 -1.946369 -0.994912
C  3.454564 1.738327 1.015593
H  -1.415307 0.611979 -1.159094
H  -2.51086 1.76163 -0.424082
H  -0.542671 2.217032 0.744705
H  -1.469255 1.211483 1.84667
H  -1.386438 -1.897414 0.830821
H  -2.891901 -2.695439 0.386226
H  -2.44596 -2.102626 -2.064646
H  -0.861414 -1.490118 -1.591116
H  -1.252561 -3.1916 -1.380304
H  2.012406 -1.886722 -2.045214
H  1.466758 -2.363177 -0.421898
H  3.157718 -2.60379 -0.894131
H  3.827761 2.750632 1.148731
H  4.29594 1.068277 0.839424
H  2.93342 1.430701 1.924682
totalener: -1676.47676494 hartree
nucrepener: 1326.02915570 hartree
electener: -3002.50592065 hartree
oneelecener: -4946.75655117 hartree
twoeener: 1944.25063052 hartree
kineticenergy: 1671.93402138 hartree
xcener: -105.500768782077 hartree
chargesum: 0.0000000
charge: 0.465168 -0.193810 0.795784 -0.331500 -0.316181 -0.576363 -0.512728 -0.196853 -0.141080 -0.153159 -0.292211 -0.128202 -0.124465 0.130821 0.121245 0.124772 0.148061 0.105698 0.112972 0.105654 0.077073 0.094418 0.126329 0.095567 0.123220 0.119303 0.116025 0.104441
qa: 0.4652 -0.1938 0.7958 -0.3315 -0.3162 -0.5764 -0.5127 -0.1969 -0.1411 -0.1532 -0.2922 -0.1282 -0.1245 0.1308 0.1212 0.1248 0.1481 0.1057 0.1130 0.1057 0.0771 0.0944 0.1263 0.0956 0.1232 0.1193 0.1160 0.1044
va: 3.6227 2.2446 5.5242 2.0886 2.1362 1.8307 2.0980 3.8939 3.8774 3.8660 3.9316 3.8835 3.8709 1.0317 1.0088 1.0122 1.0246 1.0277 1.0142 1.0129 1.0179 0.9990 0.9888 0.9872 0.9937 0.9905 0.9911 0.9985
dispcorr: -0.013715259 hartree
energy: -1676.490480201785
dipole: 1.37661 0.05624 1.43286 -7.17382 6.52793 -0.64589 -2.19989 2.00807 -0.19182
magnitude: 1.58337 au
magnitude: 4.02460 debye
