program: Orca
programVersion: 5.0.2
elementType: S P O O O O N C C C C C H H H H H H H H H H H H
charge: 0
multiplicity: 1
keywords: wb97x-d3
keywords: def2-TZVPP
keywords: def2/J RIJCOSX
keywords: DEFGRID2
keywords: scfconv7
keywords: smallprint printgap noloewdin
keywords: NOSOSCF
formula: C5H12NO4PS
InChI: InChI=1/C5H12NO4PS/c1-6-5(7)4-12-11(8,9-2)10-3/h6H,4H2,1-3H3
24 atoms
S  0.064965 -0.895307 1.564893
P  1.36064 0.290232 0.463684
O  0.488394 1.058339 -0.629648
O  2.133507 -0.772705 -0.427953
O  2.160792 1.149057 1.366658
O  -2.058169 -1.107156 -1.719043
N  -2.54195 0.03697 0.159709
C  -0.870112 -1.730403 0.240437
C  -1.862807 -0.878101 -0.529137
C  -0.154623 2.296666 -0.287116
C  3.077716 -0.339486 -1.42571
C  -3.495812 0.925554 -0.463963
H  -0.187173 -2.208525 -0.458163
H  -1.419841 -2.527778 0.747279
H  -2.296019 0.210923 1.121562
H  -0.684396 2.231578 0.663824
H  -0.870184 2.504936 -1.07715
H  0.576433 3.102088 -0.238725
H  3.611698 -1.227422 -1.751928
H  3.790687 0.372955 -1.012099
H  2.56386 0.105541 -2.276204
H  -3.693842 1.750093 0.213931
H  -4.439872 0.421773 -0.674956
H  -3.108718 1.335028 -1.395643
elementType: S P O N C H
totalener: -1293.17652671 hartree
nucrepener: 1062.46100369 hartree
electener: -2355.63753041 hartree
oneelecener: -3892.16683414 hartree
twoeener: 1536.52930374 hartree
cpcmener: -0.04639814 hartree
kineticenergy: 1289.35655185 hartree
xcener: -86.900777627235 hartree
chargesum: -0.0000000
charge: -0.166907 0.834577 -0.342566 -0.344382 -0.644979 -0.559600 -0.194928 -0.071366 0.314665 -0.127115 -0.111740 -0.176439 0.127568 0.154599 0.184178 0.118031 0.132780 0.140648 0.129363 0.122001 0.125773 0.125185 0.125122 0.105529
qa: -0.1669 0.8346 -0.3426 -0.3444 -0.6450 -0.5596 -0.1949 -0.0714 0.3147 -0.1271 -0.1117 -0.1764 0.1276 0.1546 0.1842 0.1180 0.1328 0.1406 0.1294 0.1220 0.1258 0.1252 0.1251 0.1055
va: 2.2752 5.4917 2.0514 2.0838 1.9688 1.9438 3.1552 3.8100 4.1729 3.8343 3.8329 3.8816 1.0401 0.9969 1.0131 0.9902 0.9867 0.9997 0.9890 0.9935 0.9923 0.9941 0.9936 0.9970
dispcorr: -0.010925927 hartree
energy: -1293.187452640055
dipole: -7.27541 6.11032 -1.16508 5.68909 -5.03110 0.65799 -6.64868 6.71758 0.06890
magnitude: 1.33982 au
magnitude: 3.40555 debye
