program: Orca
programVersion: 5.0.2
elementType: Br Br Cl Cl P O O O O C C C C H H H H H H H
charge: 0
multiplicity: 1
keywords: wb97x-d3
keywords: def2-TZVPP
keywords: def2/J RIJCOSX
keywords: DEFGRID2
keywords: scfconv7
keywords: smallprint printgap noloewdin
keywords: NOSOSCF
formula: C4H7Br2Cl2O4P
InChI: InChI=1/C4H7Br2Cl2O4P/c1-10-13(9,11-2)12-3(5)4(6,7)8/h3H,1-2H3
20 atoms
Br 0.965212 1.95933 1.03925
Br 1.750712 -0.175007 -1.631328
Cl 0.366921 -2.330892 -0.04177
Cl 2.557956 -0.94135 1.182469
P  -2.394524 -0.21441 0.140771
O  -0.908003 0.386125 -0.126905
O  -3.342613 1.026122 -0.123006
O  -2.562841 -1.053511 -1.184482
O  -2.53817 -0.898091 1.436985
C  0.154446 0.213398 0.731678
C  1.17424 -0.761531 0.112154
C  -3.635043 1.974521 0.910827
C  -3.728415 -1.865987 -1.388615
H  -0.139669 -0.17983 1.710758
H  -2.795702 2.654932 1.056921
H  -3.874046 1.482532 1.853394
H  -4.499173 2.544626 0.579932
H  -4.605913 -1.246896 -1.573228
H  -3.913123 -2.517936 -0.53475
H  -3.530778 -2.477729 -2.26454
elementType: Br Cl P O C H
totalener: -6867.92189718 hartree
nucrepener: 2296.77107833 hartree
electener: -9164.69297551 hartree
twoeener: 4951.71369247 hartree
cpcmener: -0.01705487 hartree
kineticenergy: 6856.68185646 hartree
xcener: -240.207253155480 hartree
chargesum: -0.0000000
charge: -0.057922 -0.002233 -0.033223 -0.023362 0.927282 -0.323166 -0.339458 -0.329955 -0.594647 0.018696 0.070860 -0.106873 -0.115701 0.172509 0.115381 0.118669 0.128752 0.126082 0.119778 0.128533
qa: -0.0579 -0.0022 -0.0332 -0.0234 0.9273 -0.3232 -0.3395 -0.3300 -0.5946 0.0187 0.0709 -0.1069 -0.1157 0.1725 0.1154 0.1187 0.1288 0.1261 0.1198 0.1285
va: 1.1979 1.2336 1.2681 1.2684 5.6334 2.1236 2.1193 2.1195 1.9933 4.1670 4.4338 3.8383 3.8381 1.0020 0.9911 0.9961 0.9897 0.9909 0.9924 0.9887
dispcorr: -0.009925939 hartree
energy: -6867.931823115271
dipole: -49.02022 47.65894 -1.36127 -11.49267 11.88437 0.39169 4.73073 -5.04492 -0.31419
magnitude: 1.45093 au
magnitude: 3.68798 debye
