program: Orca
programVersion: 5.0.2
elementType: P O O O O O N C C C C C C C H H H H H H H H H H H H H H
charge: 0
multiplicity: 1
keywords: wb97x-d3
keywords: def2-TZVPP
keywords: def2/J RIJCOSX
keywords: DEFGRID2
keywords: scfconv7
keywords: smallprint printgap noloewdin
keywords: NOSOSCF
formula: C7H14NO5P
InChI: InChI=1/C7H14NO5P/c1-6(5-7(9)8-2)13-14(10,11-3)12-4/h5,8H,1-4H3
28 atoms
P  -1.946067 0.231559 0.362889
O  -0.738124 -0.27127 1.293404
O  -1.429418 1.659171 -0.086495
O  -1.881459 -0.585873 -0.999003
O  -3.220363 0.138572 1.101103
O  3.180999 -1.941635 -0.516928
N  3.079186 0.296301 -0.746688
C  0.603938 -0.097993 0.960596
C  1.144452 -0.898397 0.04473
C  1.25227 0.949575 1.791451
C  2.55637 -0.886221 -0.408569
C  -2.222993 2.498605 -0.940757
C  -2.385504 -1.928494 -1.061133
C  4.431276 0.433361 -1.236862
H  0.545676 -1.690395 -0.390199
H  2.335325 0.917237 1.720327
H  0.979004 0.807948 2.838046
H  0.916932 1.946733 1.500589
H  2.494865 1.116464 -0.723633
H  -1.75472 3.478521 -0.936223
H  -3.242881 2.58944 -0.568345
H  -2.236549 2.110053 -1.957953
H  -3.46599 -1.944537 -0.926036
H  -1.914438 -2.56579 -0.312548
H  -2.141666 -2.306754 -2.0497
H  5.141631 -0.073702 -0.585558
H  4.683897 1.489653 -1.255949
H  4.541314 0.035726 -2.246981
elementType: P O N C H
totalener: -1047.62564194 hartree
nucrepener: 1130.91537359 hartree
electener: -2178.54101553 hartree
oneelecener: -3684.53580093 hartree
twoeener: 1505.99478540 hartree
cpcmener: -0.05170254 hartree
kineticenergy: 1043.78042625 hartree
xcener: -81.878603040693 hartree
chargesum: 0.0000000
charge: 0.942424 -0.357279 -0.331247 -0.346128 -0.643740 -0.585904 -0.198779 0.185264 -0.190971 -0.228592 0.401969 -0.113909 -0.119544 -0.167095 0.147916 0.096084 0.110618 0.112543 0.192802 0.126683 0.119678 0.125686 0.128160 0.124997 0.132357 0.106625 0.115852 0.113531
qa: 0.9424 -0.3573 -0.3312 -0.3461 -0.6437 -0.5859 -0.1988 0.1853 -0.1910 -0.2286 0.4020 -0.1139 -0.1195 -0.1671 0.1479 0.0961 0.1106 0.1125 0.1928 0.1267 0.1197 0.1257 0.1282 0.1250 0.1324 0.1066 0.1159 0.1135
va: 5.5904 2.0996 2.0961 2.0602 1.9718 1.9086 3.1914 3.7392 3.9373 3.9564 4.1240 3.8347 3.8254 3.9040 1.0116 1.0190 1.0045 1.0036 0.9896 0.9888 0.9930 0.9908 0.9980 0.9851 0.9884 0.9970 0.9989 0.9886
dispcorr: -0.011494440 hartree
energy: -1047.637136384631
dipole: 8.75963 -8.26706 0.49257 5.20857 -2.73219 2.47638 -5.69715 4.14068 -1.55647
magnitude: 2.96609 au
magnitude: 7.53920 debye
