program: Orca
programVersion: 5.0.2
elementType: P O O O O O N C C C C C C C H H H H H H H H H H H H H H
charge: 0
multiplicity: 1
keywords: wb97x-d3
keywords: def2-TZVPP
keywords: def2/J RIJCOSX
keywords: DEFGRID2
keywords: scfconv7
keywords: smallprint printgap noloewdin
keywords: NOSOSCF
formula: C7H14NO5P
InChI: InChI=1/C7H14NO5P/c1-6(5-7(9)8-2)13-14(10,11-3)12-4/h5,8H,1-4H3
28 atoms
P  -1.685086 0.501718 0.07969
O  -0.686588 -0.405934 -0.811464
O  -2.784327 0.874852 -0.9964
O  -2.438266 -0.483267 1.058931
O  -1.027988 1.604299 0.808361
O  3.320798 -1.326689 0.611759
N  3.672137 0.864728 0.264063
C  0.533055 -0.854622 -0.317216
C  1.534261 0.025745 -0.261524
C  0.488775 -2.293265 0.038357
C  2.898753 -0.230599 0.24012
C  -2.518949 1.868851 -1.999048
C  -3.217163 -1.602238 0.608953
C  5.025509 0.847467 0.762952
H  1.333144 1.035217 -0.599807
H  -0.205577 -2.453487 0.866671
H  1.459962 -2.678757 0.32143
H  0.114893 -2.871759 -0.808333
H  3.281072 1.748059 -0.020137
H  -2.169164 2.79685 -1.549186
H  -3.458207 2.053305 -2.511901
H  -1.782482 1.508777 -2.7160
H  -4.177754 -1.266139 0.222873
H  -3.381642 -2.235609 1.475699
H  -2.696769 -2.177706 -0.155635
H  5.06265 0.680903 1.8402
H  5.480798 1.810115 0.553436
H  5.621343 0.077739 0.275686
elementType: P O N C H
totalener: -1047.62874994 hartree
nucrepener: 1118.79791027 hartree
electener: -2166.42666021 hartree
oneelecener: -3661.21246878 hartree
twoeener: 1494.78580857 hartree
cpcmener: -0.04828565 hartree
kineticenergy: 1043.79215812 hartree
xcener: -81.883339685031 hartree
chargesum: 0.0000000
charge: 0.959681 -0.354891 -0.340964 -0.360411 -0.641806 -0.592476 -0.185360 0.247323 -0.243302 -0.265399 0.434387 -0.109497 -0.119957 -0.166888 0.124814 0.112864 0.112382 0.113249 0.180907 0.117716 0.129944 0.126850 0.129985 0.132257 0.125030 0.112854 0.115642 0.105065
qa: 0.9597 -0.3549 -0.3410 -0.3604 -0.6418 -0.5925 -0.1854 0.2473 -0.2433 -0.2654 0.4344 -0.1095 -0.1200 -0.1669 0.1248 0.1129 0.1124 0.1132 0.1809 0.1177 0.1299 0.1268 0.1300 0.1323 0.1250 0.1129 0.1156 0.1051
va: 5.5770 2.0810 2.0962 2.1018 1.9656 1.9121 3.2213 3.7155 3.8856 3.9460 4.1400 3.8273 3.8268 3.9033 1.0228 0.9953 1.0405 0.9984 1.0014 0.9949 0.9889 0.9894 0.9947 0.9881 0.9869 0.9898 0.9980 0.9960
dispcorr: -0.010946651 hartree
energy: -1047.639696587427
dipole: 5.51825 -6.58912 -1.07087 -2.45511 2.92820 0.47309 -2.85366 0.95446 -1.89920
magnitude: 2.23103 au
magnitude: 5.67084 debye
