program: Orca
programVersion: 5.0.2
elementType: P O O O O O N C C C C C C C H H H H H H H H H H H H H H
charge: 0
multiplicity: 1
keywords: wb97x-d3
keywords: def2-TZVPP
keywords: def2/J RIJCOSX
keywords: DEFGRID2
keywords: scfconv7
keywords: smallprint printgap noloewdin
keywords: NOSOSCF
formula: C7H14NO5P
InChI: InChI=1/C7H14NO5P/c1-6(5-7(9)8-2)13-14(10,11-3)12-4/h5,8H,1-4H3
28 atoms
P  -2.022929 0.330469 0.296059
O  -0.605573 0.011886 -0.410942
O  -2.775823 1.068395 -0.885943
O  -2.801482 -1.038265 0.420913
O  -1.915198 1.031282 1.589704
O  3.351036 -0.460451 1.299065
N  3.984518 0.332033 -0.708193
C  0.567015 -0.337167 0.231342
C  1.669202 0.223852 -0.271725
C  0.436408 -1.344977 1.315898
C  3.050689 -0.011356 0.190892
C  -2.35931 2.373409 -1.317989
C  -2.95055 -1.963382 -0.666841
C  5.398014 0.208691 -0.448696
H  1.548794 0.900643 -1.110393
H  1.398588 -1.76097 1.590951
H  -0.209865 -2.162353 0.99249
H  -0.005997 -0.90609 2.212418
H  3.693109 0.695797 -1.60097
H  -1.396282 2.323769 -1.824946
H  -2.295914 3.065418 -0.478837
H  -3.113417 2.726773 -2.015026
H  -1.987599 -2.221634 -1.106139
H  -3.60623 -1.556418 -1.435126
H  -3.400694 -2.860111 -0.250962
H  5.662548 -0.799355 -0.132454
H  5.73733 0.908204 0.316687
H  5.936216 0.425488 -1.366165
elementType: P O N C H
totalener: -1047.62898006 hartree
nucrepener: 1109.33601419 hartree
electener: -2156.96499425 hartree
oneelecener: -3642.09665880 hartree
twoeener: 1485.13166455 hartree
cpcmener: -0.05141169 hartree
kineticenergy: 1043.77701966 hartree
xcener: -81.881695084868 hartree
chargesum: -0.0000000
charge: 0.935768 -0.322467 -0.345559 -0.352974 -0.634908 -0.593906 -0.184723 0.204178 -0.250044 -0.234898 0.421984 -0.107944 -0.111589 -0.165403 0.133863 0.105937 0.121589 0.114947 0.182276 0.124634 0.118738 0.129181 0.120571 0.128845 0.130897 0.103725 0.112090 0.115190
qa: 0.9358 -0.3225 -0.3456 -0.3530 -0.6349 -0.5939 -0.1847 0.2042 -0.2500 -0.2349 0.4220 -0.1079 -0.1116 -0.1654 0.1339 0.1059 0.1216 0.1149 0.1823 0.1246 0.1187 0.1292 0.1206 0.1288 0.1309 0.1037 0.1121 0.1152
va: 5.5891 2.0759 2.1072 2.0923 1.9660 1.9022 3.2072 3.7862 3.8722 3.9057 4.1243 3.8308 3.8243 3.9061 1.0176 1.0323 0.9974 1.0114 1.0002 0.9899 0.9934 0.9890 0.9904 0.9939 0.9884 0.9941 0.9899 0.9982
dispcorr: -0.010818967 hartree
energy: -1047.639799024320
dipole: 9.50198 -9.30980 0.19218 -2.16072 2.04745 -0.11327 -6.81296 2.84908 -3.96388
magnitude: 3.97015 au
magnitude: 10.09133 debye
