program: Gaussian 09
title: 000058653
version: EM64L-G09RevD.01
frameworkgroup: C1[X(C12H16N2O2)]
method: RPBEPBE
basis: SDD
operation: Freq
keyword: #p
keyword: freq=noraman
keyword: PBEPBE/SDD
title: #p freq=noraman PBEPBE/SDD
converged: YES YES NO NO
title: Mulliken charges:
elementType: O O N N C C C C C C C C C C C C H H H H H H H H H H H H H H H H
charge: -0.331159 -0.436943 -0.412296 -0.594801 0.412168 -0.567760 0.122572 -0.060426 0.273041 -0.451038 -0.554334 -0.702438 -0.467074 0.205983 0.151195 -0.522221 0.229078 0.193383 0.201059 0.268883 0.302982 0.244210 0.200251 0.219942 0.233755 0.251801 0.266467 0.258341 0.377802 0.240308 0.223936 0.223334
chargesum: 0.00000
title: Mulliken charges with hydrogens summed into heavy atoms:
elementType: O O N N C C C C C C C C C C C C
charge: -0.331159 -0.059141 -0.109314 -0.069993 0.412168 -0.145299 0.122572 0.140633 0.273041 -0.182155 -0.310124 -0.048490 -0.215272 0.205983 0.151195 0.165357
polarizability: 2.00703148e+02 -1.35522743e+01 1.71643931e+02 -1.16290479e+01 -3.90707264e+00 9.14214110e+01
1716.lowfreq: -7.2214 -6.1090 0.0002 0.0008 0.0008 4.5326 30.3076 52.1906 58.7570
frequency: 30.2101 52.1699 58.7304 82.0249 130.7941 148.5590 164.0929 208.1171 221.4066 233.2730 258.4278 268.2096 302.9654 335.6215 353.5165 369.1665 395.0569 419.2711 430.4180 439.8853 475.5833 486.6104 490.1157 495.5612 591.9036 599.6240 611.4411 670.7800 694.1356 728.6549 743.0886 775.3874 809.5490 819.4805 827.1268 840.6758 843.7176 891.3563 954.6085 981.4788 997.4787 1036.5225 1064.9074 1092.3669 1117.6217 1126.8916 1141.0720 1151.3643 1170.2394 1204.6951 1220.0602 1223.1219 1242.4271 1254.4305 1286.5101 1307.3736 1339.4228 1344.9769 1369.4772 1382.0372 1398.6170 1418.4034 1440.7736 1457.4268 1462.3270 1469.4573 1475.4772 1475.7237 1487.7656 1505.0317 1564.9163 1600.9974 1630.8525 1648.4508 2861.5580 2947.4196 2960.0959 2975.3476 3036.8344 3047.3942 3066.2126 3092.1122 3122.2884 3152.1138 3165.7516 3221.4785 3439.6773 3507.3376 3569.1588 3617.1858
redmass: 2.9541 3.7600 3.8039 3.7250 4.9751 3.6630 2.8768 1.5133 1.3112 1.7116 1.4438 2.2309 3.6938 3.4212 3.9790 5.2394 3.8285 2.7943 3.6030 2.1429 4.5215 2.5633 1.3730 1.2089 1.4007 3.9040 2.9002 6.0869 3.8953 6.1857 3.4057 1.5175 4.7549 3.2881 1.7532 1.7324 2.2082 1.4540 1.9834 4.1256 1.6374 2.8378 2.1391 1.5948 1.2569 2.0686 2.7591 1.3444 1.9848 1.5199 1.4653 1.4622 2.4553 1.4223 1.5563 2.1650 2.5692 1.4753 1.5190 1.3177 4.1343 2.3261 1.3531 1.0964 1.0504 1.0519 1.0767 1.0776 4.6876 4.4744 6.5456 5.9815 1.0992 7.6050 1.0821 1.0663 1.0326 1.0363 1.0943 1.1041 1.0983 1.0994 1.0998 1.0911 1.0928 1.0982 1.0445 1.0644 1.0974 1.0809
irintensity: 0.2187 2.3519 0.7062 8.3295 0.3833 0.4591 2.9142 3.3661 1.8023 6.9761 28.9616 4.9224 5.6016 16.8638 4.9398 4.2132 9.7579 9.6799 1.8891 13.3024 14.3339 6.4076 43.9832 207.0211 203.7397 2.4143 8.9301 0.5641 0.5313 7.5114 0.5205 30.8284 7.4103 75.5120 26.7631 25.5626 12.8789 5.1458 2.9920 19.4056 3.0295 25.9716 17.2935 39.7780 0.1550 47.9061 33.7565 70.1418 109.5627 18.1400 15.8292 8.5123 42.3382 108.0069 10.9775 13.0519 119.7746 36.2433 1.9795 31.7229 3.8669 124.2899 2.4618 2.8852 14.6212 8.0449 16.5199 30.6775 45.6494 22.5988 25.9283 15.4727 46.5576 12.5540 96.8551 48.0889 58.9057 32.6185 23.9479 47.5195 39.0951 32.8058 25.7945 10.2202 4.2164 0.7003 2.1954 98.1912 0.1107 59.4259
temp: 298.150 k
press: 1.00000 atm
elementType: 8 8 7 7 6 6 6 6 6 6 6 6 6 6 6 6 1 1 1 1 1 1 1 1 1 1 1 1 1 1 1 1
symmnumber: 1
zpe: 688594.3 jmol-1
zpe.correction: 0.262272 hartree
zpe.thermalcorrener: 0.278378 hartree
zpe.thermalcorrenthalpy: 0.279323 hartree
zpe.thermalcorrgfe: 0.218768 hartree
zpe.sumelectzpe: -725.615703 hartree
zpe.sumelectthermal: -725.599596 hartree
zpe.sumelectthermalent: -725.598652 hartree
zpe.sumelectthermalfe: -725.659207 hartree
dipole: 0.9856 1.8254 0.0146
dipole: 2.0745
quadrupole: -106.6558 -68.3822 -99.1474
quadrupole: -6.5697 3.2398 -0.9075
quadrupole: -15.2607 23.0130 -7.7523 -6.5697 3.2398 -0.9075
hfenergy: -725.8779749 hartree
pointgroup: C01 [X(C12H16N2O2)]
dipole: -0.3499463 0.7348527 -0.0605237 debye
polarizability: 201.3762505|10.8075542|170.4541483|-15.2124554|-2.600722|91.9380904 unknown
InChI: InChI=1S/C12H16N2O2/c1-7(13)3-8-6-14-10-5-11(15)12(16-2)4-9(8)10/h4-7,14-15H,3,13H2,1-2H3
charge 0 multiplicity 1
32 atoms
O  3.000197 1.640954 -0.370215
O  4.041535 -0.776044 -0.665464
N  -0.434822 -2.706417 0.272688
N  -3.941649 2.193818 -0.041759
C  -1.48385 -0.687942 0.546812
C  -2.545694 0.351876 0.799449
C  -0.081212 -0.452456 0.239404
C  -2.994857 1.137137 -0.469698
C  0.550139 -1.733704 0.072825
C  -1.656196 -2.073114 0.559085
C  0.701956 0.72994 0.100169
C  -3.694148 0.223663 -1.492804
C  1.92425 -1.877818 -0.229343
C  2.063854 0.588966 -0.197261
C  2.674063 -0.702128 -0.363864
C  2.506995 3.007351 -0.226597
H  -3.451112 -0.108306 1.237585
H  -2.176355 1.08899 1.545076
H  -2.0755 1.551025 -0.954513
H  -2.557121 -2.651658 0.755643
H  -0.286639 -3.711515 0.229202
H  0.244712 1.715829 0.227798
H  -3.989344 0.790997 -2.39664
H  -4.607093 -0.209663 -1.044599
H  -3.023762 -0.594939 -1.806709
H  2.414856 -2.846523 -0.358634
H  -4.384632 2.696858 -0.817931
H  -3.562973 2.834998 0.664129
H  4.392117 0.153356 -0.714044
H  3.377126 3.657588 -0.401039
H  2.109188 3.179839 0.792339
H  1.719773 3.225042 -0.97449
