program: Orca
programVersion: 5.0.2
elementType: P O O O O O O C C C C C C C H H H H H H H H H H H H H
charge: 0
multiplicity: 1
keywords: wb97x-d3
keywords: def2-TZVPP
keywords: def2/J RIJCOSX
keywords: DEFGRID2
keywords: scfconv7
keywords: smallprint printgap noloewdin
keywords: NOSOSCF
formula: C7H13O6P
InChI: InChI=1/C7H13O6P/c1-6(5-7(8)10-2)13-14(9,11-3)12-4/h5H,1-4H3
27 atoms
P  1.679774 -0.202575 0.487241
O  0.115676 0.23075 0.514629
O  1.529648 -1.775466 0.526429
O  2.185027 0.097008 -0.977493
O  2.51809 0.430428 1.52096
O  -2.089759 -0.599734 -0.697951
O  -3.743224 0.891667 -0.843587
C  -0.413451 1.478787 0.403789
C  0.409273 2.635119 0.85187
C  -1.663753 1.627857 -0.057003
C  1.196584 -2.462248 1.744537
C  1.572053 -0.459351 -2.152944
C  -2.595084 0.617517 -0.556111
C  -2.953231 -1.613511 -1.212601
H  1.302505 2.751394 0.23585
H  0.729189 2.515412 1.886668
H  -0.167458 3.552633 0.774627
H  -2.059313 2.633673 -0.061738
H  0.13785 -2.3441 1.970269
H  1.793011 -2.098189 2.580025
H  1.416097 -3.512945 1.58011
H  1.895669 -1.488599 -2.296156
H  1.907048 0.143999 -2.991817
H  0.484542 -0.421212 -2.101018
H  -2.348295 -2.513374 -1.274446
H  -3.321464 -1.359789 -2.206626
H  -3.79859 -1.79311 -0.548496
elementType: P O C H
totalener: -1067.48565595 hartree
nucrepener: 1156.94399401 hartree
electener: -2224.42964996 hartree
oneelecener: -3765.18370369 hartree
twoeener: 1540.75405373 hartree
cpcmener: -0.03975602 hartree
kineticenergy: 1063.63617056 hartree
xcener: -82.903404898871 hartree
chargesum: -0.0000000
charge: 0.920133 -0.306217 -0.340228 -0.343224 -0.627987 -0.281240 -0.516811 0.248386 -0.208124 -0.286796 -0.106650 -0.099017 0.501860 -0.132492 0.115651 0.117033 0.105513 0.131264 0.126458 0.117682 0.129115 0.126284 0.130344 0.114158 0.123180 0.118187 0.123538
qa: 0.9201 -0.3062 -0.3402 -0.3432 -0.6280 -0.2812 -0.5168 0.2484 -0.2081 -0.2868 -0.1066 -0.0990 0.5019 -0.1325 0.1157 0.1170 0.1055 0.1313 0.1265 0.1177 0.1291 0.1263 0.1303 0.1142 0.1232 0.1182 0.1235
va: 5.5919 2.1281 2.1075 2.0946 1.9827 2.0996 1.9797 3.8150 3.8978 3.8512 3.8265 3.8196 4.1331 3.8632 1.0042 1.0069 1.0104 1.0188 0.9901 0.9964 0.9886 0.9922 0.9907 0.9944 0.9956 0.9935 0.9936
dispcorr: -0.011314099 hartree
energy: -1067.496970051217
dipole: -3.64148 3.77353 0.13206 -3.52401 2.08825 -1.43577 -2.81484 2.07695 -0.73789
magnitude: 1.61968 au
magnitude: 4.11689 debye
