program: Orca
programVersion: 5.0.2
elementType: P O O O O O O C C C C C C C H H H H H H H H H H H H H
charge: 0
multiplicity: 1
keywords: wb97x-d3
keywords: def2-TZVPP
keywords: def2/J RIJCOSX
keywords: DEFGRID2
keywords: scfconv7
keywords: smallprint printgap noloewdin
keywords: NOSOSCF
formula: C7H13O6P
InChI: InChI=1/C7H13O6P/c1-6(5-7(8)10-2)13-14(9,11-3)12-4/h5H,1-4H3
27 atoms
P  0.941315 -0.328893 0.311126
O  0.47854 0.845469 -0.694191
O  0.92767 -1.515981 -0.73985
O  2.459027 -0.017798 0.655105
O  0.153294 -0.469066 1.550042
O  -1.924192 -0.431736 -0.64431
O  -3.374585 0.466454 0.796184
C  -0.295728 1.912329 -0.302829
C  0.446842 3.196815 -0.311525
C  -1.581329 1.785956 0.03778
C  1.154945 -2.861437 -0.28248
C  3.481378 0.021382 -0.352075
C  -2.377484 0.554996 0.112844
C  -2.54829 -1.709653 -0.519257
H  -0.203871 4.031887 -0.065165
H  0.889705 3.376384 -1.292772
H  1.265438 3.165316 0.411162
H  -2.092778 2.684008 0.356913
H  0.437782 -3.13883 0.489407
H  2.168887 -2.980201 0.100638
H  1.020154 -3.508301 -1.144601
H  4.335738 0.526913 0.090712
H  3.164223 0.577632 -1.234687
H  3.772825 -0.988157 -0.641182
H  -2.480933 -2.085752 0.501496
H  -2.00238 -2.373697 -1.183352
H  -3.592948 -1.677234 -0.827291
elementType: P O C H
totalener: -1067.48472029 hartree
nucrepener: 1190.13017134 hartree
electener: -2257.61489163 hartree
oneelecener: -3832.58292724 hartree
twoeener: 1574.96803561 hartree
cpcmener: -0.04587067 hartree
kineticenergy: 1063.64216821 hartree
xcener: -82.902940845987 hartree
chargesum: -0.0000000
charge: 0.957995 -0.351434 -0.344065 -0.360159 -0.630370 -0.282264 -0.496881 0.251351 -0.206614 -0.265406 -0.125503 -0.111192 0.491910 -0.142104 0.105628 0.111011 0.109529 0.136542 0.124702 0.134864 0.135045 0.129059 0.123767 0.120762 0.123549 0.128393 0.131886
qa: 0.9580 -0.3514 -0.3441 -0.3602 -0.6304 -0.2823 -0.4969 0.2514 -0.2066 -0.2654 -0.1255 -0.1112 0.4919 -0.1421 0.1056 0.1110 0.1095 0.1365 0.1247 0.1349 0.1350 0.1291 0.1238 0.1208 0.1235 0.1284 0.1319
va: 5.5622 2.1112 2.0674 2.0994 1.9670 2.0891 1.9935 3.7988 3.9520 3.9231 3.8226 3.8434 4.1196 3.8461 1.0081 1.0006 1.0010 1.0166 0.9937 0.9884 0.9873 0.9905 0.9900 0.9876 0.9955 0.9933 0.9965
dispcorr: -0.012413205 hartree
energy: -1067.497133497898
dipole: 5.67536 -2.89181 2.78355 -2.18247 1.74209 -0.44038 -4.45411 2.31337 -2.14073
magnitude: 3.53905 au
magnitude: 8.99554 debye
