program: Orca
programVersion: 5.0.2
elementType: P O O O O O O C C C C C C C H H H H H H H H H H H H H
charge: 0
multiplicity: 1
keywords: wb97x-d3
keywords: def2-TZVPP
keywords: def2/J RIJCOSX
keywords: DEFGRID2
keywords: scfconv7
keywords: smallprint printgap noloewdin
keywords: NOSOSCF
formula: C7H13O6P
InChI: InChI=1/C7H13O6P/c1-6(5-7(8)10-2)13-14(9,11-3)12-4/h5H,1-4H3
27 atoms
P  1.547075 0.122343 0.511645
O  0.580821 1.058935 -0.374873
O  0.520617 -0.996405 0.979247
O  2.503889 -0.491321 -0.584662
O  2.303864 0.796233 1.584034
O  -3.391768 -0.218122 -0.322573
O  -1.446414 -0.626695 -1.341176
C  -0.474433 1.766679 0.152092
C  -0.099881 3.043878 0.808936
C  -1.727314 1.323268 0.025793
C  0.953442 -2.045913 1.860364
C  2.038878 -1.278849 -1.692345
C  -2.127931 0.069293 -0.621724
C  -3.947615 -1.405655 -0.886018
H  0.48488 2.862328 1.712341
H  -0.983629 3.613957 1.082916
H  0.516187 3.647591 0.14072
H  -2.511111 1.936185 0.4496
H  0.111124 -2.722184 1.973569
H  1.229694 -1.646791 2.835199
H  1.795001 -2.594823 1.437707
H  1.378235 -2.080858 -1.36608
H  2.922224 -1.714183 -2.150611
H  1.52873 -0.653083 -2.422784
H  -4.96765 -1.461074 -0.517054
H  -3.402979 -2.29389 -0.565845
H  -3.962303 -1.362741 -1.97498
elementType: P O C H
totalener: -1067.48662453 hartree
nucrepener: 1164.24993001 hartree
electener: -2231.73655453 hartree
oneelecener: -3781.16369772 hartree
twoeener: 1549.42714319 hartree
cpcmener: -0.03928590 hartree
kineticenergy: 1063.63851670 hartree
xcener: -82.901041031659 hartree
chargesum: 0.0000000
charge: 0.925041 -0.342436 -0.325056 -0.343107 -0.640536 -0.285171 -0.498312 0.252399 -0.198941 -0.283656 -0.116366 -0.112515 0.511118 -0.123657 0.103811 0.105032 0.113543 0.136510 0.125167 0.125397 0.126925 0.121071 0.135955 0.124528 0.129811 0.116025 0.117421
qa: 0.9250 -0.3424 -0.3251 -0.3431 -0.6405 -0.2852 -0.4983 0.2524 -0.1989 -0.2837 -0.1164 -0.1125 0.5111 -0.1237 0.1038 0.1050 0.1135 0.1365 0.1252 0.1254 0.1269 0.1211 0.1360 0.1245 0.1298 0.1160 0.1174
va: 5.5909 2.1140 2.0700 2.1025 1.9769 2.1144 1.9891 3.8171 3.9474 3.8844 3.8387 3.8221 4.1051 3.8595 1.0128 1.0068 1.0004 1.0195 0.9892 0.9961 0.9842 0.9898 0.9908 0.9939 0.9941 0.9933 0.9940
dispcorr: -0.011333794 hartree
energy: -1067.497958321445
dipole: -6.58454 4.90714 -1.67740 -4.78404 3.74712 -1.03692 -0.43629 0.21575 -0.22054
magnitude: 1.98432 au
magnitude: 5.04373 debye
