program: Orca
programVersion: 5.0.2
elementType: P O O O O O O C C C C C C C H H H H H H H H H H H H H
charge: 0
multiplicity: 1
keywords: wb97x-d3
keywords: def2-TZVPP
keywords: def2/J RIJCOSX
keywords: DEFGRID2
keywords: scfconv7
keywords: smallprint printgap noloewdin
keywords: NOSOSCF
formula: C7H13O6P
InChI: InChI=1/C7H13O6P/c1-6(5-7(8)10-2)13-14(9,11-3)12-4/h5H,1-4H3
27 atoms
P  1.447188 -0.237181 0.345397
O  0.192118 0.456517 -0.393631
O  1.365425 -1.724924 -0.209541
O  2.654767 0.361295 -0.500271
O  1.493266 -0.077733 1.804345
O  -2.276772 -0.581935 -0.628253
O  -3.966565 0.801432 -0.167362
C  -0.452949 1.572131 0.042007
C  0.409498 2.729415 0.420868
C  -1.788073 1.627286 0.063802
C  0.542827 -2.679796 0.456931
C  3.993231 0.021825 -0.152413
C  -2.783502 0.593074 -0.250175
C  -3.219197 -1.590456 -0.958044
H  0.977445 2.510664 1.326684
H  -0.191815 3.61553 0.607029
H  1.122713 2.955216 -0.373256
H  -2.231676 2.566313 0.362855
H  0.684099 -3.627276 -0.056987
H  -0.508599 -2.397903 0.40225
H  0.829494 -2.790439 1.502668
H  4.644746 0.631734 -0.773072
H  4.197393 -1.030333 -0.355948
H  4.199509 0.232095 0.897519
H  -2.636591 -2.450945 -1.277844
H  -3.878119 -1.28098 -1.769721
H  -3.834758 -1.866605 -0.100795
totalener: -1067.47159937 hartree
nucrepener: 1151.39935466 hartree
electener: -2218.87095403 hartree
oneelecener: -3753.95711245 hartree
twoeener: 1535.08615842 hartree
kineticenergy: 1063.70990381 hartree
xcener: -82.903568365916 hartree
chargesum: -0.0000000
charge: 0.870418 -0.298353 -0.330294 -0.325109 -0.510287 -0.269056 -0.375999 0.243038 -0.220100 -0.251181 -0.118697 -0.131614 0.406517 -0.133911 0.117194 0.089152 0.110971 0.106622 0.115108 0.098762 0.123939 0.115936 0.113488 0.118708 0.100626 0.118845 0.115280
qa: 0.8704 -0.2984 -0.3303 -0.3251 -0.5103 -0.2691 -0.3760 0.2430 -0.2201 -0.2512 -0.1187 -0.1316 0.4065 -0.1339 0.1172 0.0892 0.1110 0.1066 0.1151 0.0988 0.1239 0.1159 0.1135 0.1187 0.1006 0.1188 0.1153
va: 5.6472 2.1785 2.1182 2.1118 2.0867 2.0953 2.1279 3.8035 3.9000 3.8337 3.8703 3.8717 4.2686 3.8987 1.0132 1.0131 1.0041 1.0264 0.9896 0.9896 0.9978 0.9906 0.9911 0.9926 0.9924 0.9996 0.9925
dispcorr: -0.011037824 hartree
energy: -1067.482637194852
dipole: 1.86384 -0.55114 1.31269 -2.79287 2.15847 -0.63440 -0.19943 -0.28862 -0.48805
magnitude: 1.53747 au
magnitude: 3.90795 debye
