program: Orca
programVersion: 5.0.2
elementType: P O O O O O O C C C C C C C H H H H H H H H H H H H H
charge: 0
multiplicity: 1
keywords: wb97x-d3
keywords: def2-TZVPP
keywords: def2/J RIJCOSX
keywords: DEFGRID2
keywords: scfconv7
keywords: smallprint printgap noloewdin
keywords: NOSOSCF
formula: C7H13O6P
InChI: InChI=1/C7H13O6P/c1-6(5-7(8)10-2)13-14(9,11-3)12-4/h5H,1-4H3
27 atoms
P  1.599818 -0.226263 0.663388
O  0.213405 0.292065 -0.01243
O  1.498035 -1.771503 0.30636
O  2.741544 0.274335 -0.315837
O  1.790874 0.157003 2.062672
O  -2.179315 -0.646259 -0.690205
O  -3.831855 0.851826 -0.775469
C  -0.410369 1.480684 0.168572
C  0.419484 2.639375 0.615527
C  -1.717234 1.596806 -0.098202
C  0.574253 -2.605624 1.001975
C  2.782975 -0.048535 -1.70126
C  -2.679467 0.584268 -0.549462
C  -3.083011 -1.636506 -1.155089
H  -0.169084 3.552873 0.607882
H  1.278849 2.783463 -0.042145
H  0.804626 2.484719 1.623492
H  -2.15471 2.577514 0.021191
H  0.760075 -3.624412 0.671506
H  -0.453448 -2.331409 0.763174
H  0.724183 -2.547437 2.080288
H  3.600942 0.524298 -2.131157
H  1.85663 0.223633 -2.209575
H  2.97445 -1.110383 -1.853359
H  -2.50438 -2.553523 -1.238105
H  -3.496507 -1.382995 -2.131895
H  -3.909709 -1.79144 -0.460732
totalener: -1067.47091079 hartree
nucrepener: 1154.06006247 hartree
electener: -2221.53097325 hartree
oneelecener: -3759.04910789 hartree
twoeener: 1537.51813464 hartree
kineticenergy: 1063.70306888 hartree
xcener: -82.904590604463 hartree
chargesum: -0.0000000
charge: 0.851461 -0.288034 -0.326400 -0.321682 -0.498887 -0.267984 -0.377477 0.227432 -0.203657 -0.270784 -0.121146 -0.125813 0.406173 -0.129702 0.088552 0.101196 0.128772 0.108321 0.114339 0.105437 0.124536 0.120663 0.110380 0.118098 0.097314 0.115493 0.113400
qa: 0.8515 -0.2880 -0.3264 -0.3217 -0.4989 -0.2680 -0.3775 0.2274 -0.2037 -0.2708 -0.1211 -0.1258 0.4062 -0.1297 0.0886 0.1012 0.1288 0.1083 0.1143 0.1054 0.1245 0.1207 0.1104 0.1181 0.0973 0.1155 0.1134
va: 5.6384 2.1146 2.1097 2.1095 2.1276 2.0923 2.1275 3.8292 3.8940 3.8182 3.8637 3.8668 4.2694 3.9063 1.0105 1.0054 1.0139 1.0257 0.9898 0.9910 0.9953 0.9890 0.9904 0.9943 0.9931 0.9983 0.9932
dispcorr: -0.011235015 hartree
energy: -1067.482145800448
dipole: -2.23295 2.86934 0.63639 -2.83017 2.02497 -0.80521 -4.86081 3.82004 -1.04077
magnitude: 1.46170 au
magnitude: 3.71534 debye
