program: Orca
programVersion: 5.0.2
elementType: P O O O O O O C C C C C C C H H H H H H H H H H H H H
charge: 0
multiplicity: 1
keywords: wb97x-d3
keywords: def2-TZVPP
keywords: def2/J RIJCOSX
keywords: DEFGRID2
keywords: scfconv7
keywords: smallprint printgap noloewdin
keywords: NOSOSCF
formula: C7H13O6P
InChI: InChI=1/C7H13O6P/c1-6(5-7(8)10-2)13-14(9,11-3)12-4/h5H,1-4H3
27 atoms
P  1.795124 0.045102 -0.272748
O  0.376883 0.291663 0.492105
O  2.431976 -1.034247 0.7106
O  1.443569 -0.81111 -1.547869
O  2.564487 1.258586 -0.559493
O  -3.761583 0.244599 -0.178724
O  -2.002425 -1.120863 -0.024616
C  -0.426438 1.381519 0.454562
C  0.20768 2.706168 0.723944
C  -1.746191 1.246044 0.270107
C  2.892301 -0.637037 1.996256
C  0.856696 -2.112812 -1.503993
C  -2.460999 -0.008429 0.014233
C  -4.589983 -0.871144 -0.460991
H  0.8142 2.664206 1.629806
H  -0.554553 3.470016 0.855983
H  0.869551 3.007214 -0.08675
H  -2.344269 2.145308 0.312064
H  3.550507 0.23087 1.935439
H  3.449936 -1.474259 2.408607
H  2.055652 -0.410604 2.65974
H  -0.023256 -2.136467 -0.864895
H  1.585017 -2.848883 -1.164851
H  0.560841 -2.348636 -2.523254
H  -4.28679 -1.378214 -1.377974
H  -5.594577 -0.475169 -0.584974
H  -4.585291 -1.597351 0.352662
totalener: -1067.47376825 hartree
nucrepener: 1143.78631326 hartree
electener: -2211.26008151 hartree
oneelecener: -3739.06933856 hartree
twoeener: 1527.80925705 hartree
kineticenergy: 1063.69206706 hartree
xcener: -82.904625138109 hartree
chargesum: -0.0000000
charge: 0.876357 -0.308524 -0.319608 -0.316191 -0.510143 -0.269129 -0.403002 0.219287 -0.198595 -0.257123 -0.133834 -0.140052 0.435012 -0.128926 0.095692 0.087517 0.122086 0.103693 0.118564 0.117126 0.111919 0.144591 0.111356 0.111351 0.105800 0.117292 0.107481
qa: 0.8764 -0.3085 -0.3196 -0.3162 -0.5101 -0.2691 -0.4030 0.2193 -0.1986 -0.2571 -0.1338 -0.1401 0.4350 -0.1289 0.0957 0.0875 0.1221 0.1037 0.1186 0.1171 0.1119 0.1446 0.1114 0.1114 0.1058 0.1173 0.1075
va: 5.6271 2.1188 2.0938 2.1432 2.1136 2.1115 2.0847 3.8845 3.9485 3.7871 3.8777 3.8439 4.2049 3.9007 1.0036 1.0090 1.0118 1.0273 0.9921 0.9926 0.9892 0.9937 0.9942 0.9905 0.9964 0.9937 0.9959
dispcorr: -0.010745806 hartree
energy: -1067.484514060187
dipole: -6.04919 5.31214 -0.73705 -1.23826 0.90733 -0.33094 3.79561 -3.00731 0.78831
magnitude: 1.12880 au
magnitude: 2.86918 debye
