program: Orca
programVersion: 5.0.2
elementType: P O O O O O O C C C C C C C H H H H H H H H H H H H H
charge: 0
multiplicity: 1
keywords: wb97x-d3
keywords: def2-TZVPP
keywords: def2/J RIJCOSX
keywords: DEFGRID2
keywords: scfconv7
keywords: smallprint printgap noloewdin
keywords: NOSOSCF
formula: C7H13O6P
InChI: InChI=1/C7H13O6P/c1-6(5-7(8)10-2)13-14(9,11-3)12-4/h5H,1-4H3
27 atoms
P  1.798801 0.016948 -0.526314
O  0.195976 0.223415 -0.51415
O  2.092535 0.134614 1.046027
O  1.892948 -1.515518 -0.902442
O  2.601813 0.88492 -1.390645
O  -3.835955 0.227585 0.507679
O  -2.120451 -1.157814 0.146729
C  -0.51199 1.334438 -0.213051
C  0.181052 2.652791 -0.306926
C  -1.805974 1.220775 0.112414
C  3.438821 0.265428 1.492913
C  1.145122 -2.534376 -0.23547
C  -2.548984 -0.037526 0.244654
C  -4.694175 -0.888484 0.668533
H  -0.521394 3.460512 -0.119318
H  0.627648 2.794961 -1.290819
H  0.985523 2.731397 0.4264
H  -2.354051 2.133914 0.294633
H  3.400525 0.420241 2.568462
H  3.935409 1.114319 1.022667
H  4.017176 -0.637884 1.289072
H  0.075754 -2.40546 -0.389926
H  1.351741 -2.541809 0.835725
H  1.466722 -3.480003 -0.663922
H  -4.388707 -1.518531 1.504702
H  -4.732441 -1.504436 -0.230879
H  -5.682216 -0.481467 0.86735
totalener: -1067.47415280 hartree
nucrepener: 1138.26337907 hartree
electener: -2205.73753186 hartree
oneelecener: -3727.94788003 hartree
twoeener: 1522.21034816 hartree
kineticenergy: 1063.69061500 hartree
xcener: -82.902997292480 hartree
chargesum: -0.0000000
charge: 0.845250 -0.274069 -0.331465 -0.316169 -0.502220 -0.271225 -0.395723 0.218453 -0.207679 -0.264633 -0.127495 -0.125616 0.431199 -0.128310 0.088389 0.124224 0.098396 0.103768 0.116489 0.122084 0.111032 0.142256 0.099551 0.114750 0.105550 0.106644 0.116570
qa: 0.8453 -0.2741 -0.3315 -0.3162 -0.5022 -0.2712 -0.3957 0.2185 -0.2077 -0.2646 -0.1275 -0.1256 0.4312 -0.1283 0.0884 0.1242 0.0984 0.1038 0.1165 0.1221 0.1110 0.1423 0.0996 0.1148 0.1056 0.1066 0.1166
va: 5.6521 2.1967 2.0442 2.1403 2.1249 2.1078 2.0958 3.8823 3.9320 3.7832 3.8711 3.8480 4.2196 3.9025 1.0094 1.0067 1.0060 1.0271 0.9886 0.9975 0.9893 0.9958 0.9931 0.9888 0.9965 0.9961 0.9935
dispcorr: -0.010675892 hartree
energy: -1067.484828687448
dipole: -3.78399 3.41921 -0.36478 -0.23436 0.24672 0.01236 6.52904 -5.27867 1.25038
magnitude: 1.30256 au
magnitude: 3.31084 debye
