program: Orca
programVersion: 5.0.2
elementType: P O O O O O O C C C C C C C H H H H H H H H H H H H H
charge: 0
multiplicity: 1
keywords: wb97x-d3
keywords: def2-TZVPP
keywords: def2/J RIJCOSX
keywords: DEFGRID2
keywords: scfconv7
keywords: smallprint printgap noloewdin
keywords: NOSOSCF
formula: C7H13O6P
InChI: InChI=1/C7H13O6P/c1-6(5-7(8)10-2)13-14(9,11-3)12-4/h5H,1-4H3
27 atoms
P  1.726078 -0.235721 0.543051
O  0.335991 0.276098 -0.14088
O  1.820223 -1.689267 -0.082896
O  2.876274 0.537707 -0.230426
O  1.773685 -0.075837 1.996819
O  -3.8249 0.406084 -0.355688
O  -2.101778 -0.991782 -0.611491
C  -0.424486 1.317701 0.269149
C  0.284295 2.527962 0.780237
C  -1.756632 1.257454 0.151777
C  0.904634 -2.712614 0.319134
C  3.053218 0.462051 -1.639621
C  -2.523068 0.094898 -0.310508
C  -4.710579 -0.617502 -0.775951
H  0.796084 2.312972 1.719094
H  -0.418154 3.339367 0.952489
H  1.03666 2.871046 0.067797
H  -2.320196 2.137274 0.427672
H  0.895343 -2.824216 1.403628
H  1.256657 -3.637633 -0.129602
H  -0.100421 -2.492359 -0.036718
H  2.134491 0.69953 -2.178675
H  3.396565 -0.526951 -1.941518
H  3.812077 1.195936 -1.899849
H  -4.493205 -0.950464 -1.79125
H  -5.706732 -0.18397 -0.745188
H  -4.673377 -1.482941 -0.113777
totalener: -1067.47470489 hartree
nucrepener: 1141.24945830 hartree
electener: -2208.72416319 hartree
oneelecener: -3733.95123795 hartree
twoeener: 1525.22707476 hartree
kineticenergy: 1063.69649354 hartree
xcener: -82.903613366283 hartree
chargesum: -0.0000000
charge: 0.860748 -0.292294 -0.325538 -0.323872 -0.498665 -0.270412 -0.396707 0.213687 -0.210553 -0.257698 -0.137254 -0.128894 0.430566 -0.128781 0.126482 0.086979 0.102188 0.103640 0.115617 0.109750 0.144119 0.109542 0.119437 0.118560 0.106386 0.116599 0.106370
qa: 0.8607 -0.2923 -0.3255 -0.3239 -0.4987 -0.2704 -0.3967 0.2137 -0.2106 -0.2577 -0.1373 -0.1289 0.4306 -0.1288 0.1265 0.0870 0.1022 0.1036 0.1156 0.1097 0.1441 0.1095 0.1194 0.1186 0.1064 0.1166 0.1064
va: 5.6305 2.1143 2.1157 2.1022 2.1274 2.1087 2.0915 3.8962 3.9057 3.7788 3.8440 3.8725 4.2192 3.9020 1.0157 1.0102 1.0032 1.0275 0.9932 0.9910 0.9910 0.9909 0.9947 0.9887 0.9958 0.9935 0.9967
dispcorr: -0.010770202 hartree
energy: -1067.485475092427
dipole: -5.69255 5.28810 -0.40445 0.79228 -0.49882 0.29346 -4.84703 3.70047 -1.14655
magnitude: 1.25072 au
magnitude: 3.17907 debye
