program: Orca
programVersion: 5.0.2
elementType: P O O O O O O C C C C C C C H H H H H H H H H H H H H
charge: 0
multiplicity: 1
keywords: wb97x-d3
keywords: def2-TZVPP
keywords: def2/J RIJCOSX
keywords: DEFGRID2
keywords: scfconv7
keywords: smallprint printgap noloewdin
keywords: NOSOSCF
formula: C7H13O6P
InChI: InChI=1/C7H13O6P/c1-6(5-7(8)10-2)13-14(9,11-3)12-4/h5H,1-4H3
27 atoms
P  -1.638068 0.720675 -0.279384
O  -0.676762 -0.246134 -1.159987
O  -3.005649 0.515753 -1.040143
O  -1.694943 -0.085075 1.085167
O  -1.253605 2.139276 -0.202919
O  3.233022 0.470794 1.244707
O  3.32086 -1.334098 -0.068644
C  0.603293 -0.620939 -0.8911
C  1.003964 -1.779043 -1.740239
C  1.350545 0.020546 0.020717
C  -3.647973 -0.754193 -1.206161
C  -1.880942 0.553167 2.356216
C  2.714496 -0.375879 0.356591
C  4.563952 0.226401 1.687375
H  1.148916 -2.674738 -1.136318
H  1.936296 -1.585554 -2.266303
H  0.232041 -1.991438 -2.476946
H  0.970852 0.887061 0.545931
H  -3.078367 -1.39697 -1.876895
H  -4.620641 -0.55364 -1.648094
H  -3.791497 -1.258181 -0.250514
H  -1.339591 -0.036838 3.091534
H  -2.940082 0.566596 2.609114
H  -1.495184 1.571261 2.361645
H  4.784097 1.003267 2.414907
H  5.278551 0.294931 0.866723
H  4.659185 -0.747854 2.167279
elementType: P O C H
totalener: -1067.48935800 hartree
nucrepener: 1125.91211701 hartree
electener: -2193.40147501 hartree
oneelecener: -3703.46173831 hartree
twoeener: 1510.06026331 hartree
cpcmener: -0.03015043 hartree
kineticenergy: 1063.63940602 hartree
xcener: -82.901897779957 hartree
chargesum: 0.0000000
charge: 0.904090 -0.300848 -0.341306 -0.335592 -0.601581 -0.287389 -0.482923 0.287329 -0.224107 -0.274407 -0.104875 -0.091564 0.469972 -0.125542 0.108354 0.104544 0.104868 0.104747 0.119867 0.127355 0.118879 0.123503 0.127084 0.114741 0.126203 0.115348 0.113249
qa: 0.9041 -0.3008 -0.3413 -0.3356 -0.6016 -0.2874 -0.4829 0.2873 -0.2241 -0.2744 -0.1049 -0.0916 0.4700 -0.1255 0.1084 0.1045 0.1049 0.1047 0.1199 0.1274 0.1189 0.1235 0.1271 0.1147 0.1262 0.1153 0.1132
va: 5.6086 2.1650 2.1324 2.0594 2.0080 2.1071 2.0285 3.7631 3.9337 3.8230 3.8346 3.8174 4.1757 3.8703 1.0048 1.0080 1.0134 1.0499 0.9911 0.9897 0.9914 0.9881 0.9890 1.0035 0.9948 0.9930 0.9942
dispcorr: -0.010394055 hartree
energy: -1067.499752054680
dipole: 2.77761 -3.91931 -1.14171 -6.53049 5.14043 -1.39006 4.35092 -3.35619 0.99473
magnitude: 2.05554 au
magnitude: 5.22477 debye
