program: Orca
programVersion: 5.0.2
elementType: P O O O O O O C C C C C C C H H H H H H H H H H H H H
charge: 0
multiplicity: 1
keywords: wb97x-d3
keywords: def2-TZVPP
keywords: def2/J RIJCOSX
keywords: DEFGRID2
keywords: scfconv7
keywords: smallprint printgap noloewdin
keywords: NOSOSCF
formula: C7H13O6P
InChI: InChI=1/C7H13O6P/c1-6(5-7(8)10-2)13-14(9,11-3)12-4/h5H,1-4H3
27 atoms
P  -1.924921 0.509161 0.260592
O  -0.466944 1.1484 0.032214
O  -2.454747 0.015895 -1.156059
O  -1.56382 -0.857403 0.972564
O  -2.791639 1.469774 0.962838
O  3.54287 -0.687463 1.241451
O  3.209917 -0.917741 -0.952521
C  0.644313 0.49982 -0.463995
C  0.672176 0.388697 -1.944011
C  1.557113 0.126888 0.438969
C  -3.025648 0.955158 -2.076187
C  -2.592256 -1.684297 1.537186
C  2.829165 -0.534433 0.129961
C  4.803575 -1.342966 1.12867
H  1.665395 0.16927 -2.318308
H  0.327085 1.321988 -2.390994
H  0.003123 -0.405217 -2.283935
H  1.357673 0.327322 1.484481
H  -3.390946 0.3813 -2.923962
H  -2.278949 1.669032 -2.426267
H  -3.858764 1.494932 -1.625686
H  -3.200032 -2.138672 0.75487
H  -3.231209 -1.114947 2.21233
H  -2.08945 -2.466393 2.099754
H  5.212665 -1.378295 2.135008
H  5.48856 -0.790872 0.48431
H  4.69624 -2.36075 0.751672
elementType: P O C H
totalener: -1067.48869488 hartree
nucrepener: 1119.57862328 hartree
electener: -2187.06731816 hartree
oneelecener: -3690.80163801 hartree
twoeener: 1503.73431985 hartree
cpcmener: -0.02994336 hartree
kineticenergy: 1063.63657897 hartree
xcener: -82.898079027447 hartree
chargesum: -0.0000000
charge: 0.921802 -0.342048 -0.342104 -0.327378 -0.612500 -0.282815 -0.475557 0.267884 -0.265903 -0.268416 -0.112158 -0.114379 0.498787 -0.125941 0.117665 0.114563 0.116734 0.131615 0.128382 0.120380 0.124361 0.123884 0.118659 0.126143 0.127283 0.115403 0.115655
qa: 0.9218 -0.3420 -0.3421 -0.3274 -0.6125 -0.2828 -0.4756 0.2679 -0.2659 -0.2684 -0.1122 -0.1144 0.4988 -0.1259 0.1177 0.1146 0.1167 0.1316 0.1284 0.1204 0.1244 0.1239 0.1187 0.1261 0.1273 0.1154 0.1157
va: 5.6168 2.1241 2.0688 2.1022 2.0115 2.1179 2.0286 3.6890 3.9471 3.9353 3.8291 3.8378 4.1063 3.8687 1.0303 1.0003 1.0002 1.0237 0.9893 0.9845 1.0004 0.9896 0.9940 0.9886 0.9941 0.9929 0.9938
dispcorr: -0.010449808 hartree
energy: -1067.499144692184
dipole: 2.80672 -2.93343 -0.12672 -5.11516 4.02046 -1.09470 -4.34815 3.75557 -0.59258
magnitude: 1.25123 au
magnitude: 3.18038 debye
