program: Orca
programVersion: 5.0.2
elementType: P O O O O O O C C C C C C C H H H H H H H H H H H H H
charge: 0
multiplicity: 1
keywords: wb97x-d3
keywords: def2-TZVPP
keywords: def2/J RIJCOSX
keywords: DEFGRID2
keywords: scfconv7
keywords: smallprint printgap noloewdin
keywords: NOSOSCF
formula: C7H13O6P
InChI: InChI=1/C7H13O6P/c1-6(5-7(8)10-2)13-14(9,11-3)12-4/h5H,1-4H3
27 atoms
P  -1.863176 0.201595 0.365683
O  -0.590618 0.552667 -0.574056
O  -3.034881 0.918493 -0.423476
O  -2.16959 -1.331466 0.142462
O  -1.660789 0.531452 1.786111
O  3.443576 -1.624773 -0.413723
O  3.479624 0.260948 0.780574
C  0.69438 0.614692 -0.083151
C  1.032087 1.891629 0.602837
C  1.477703 -0.441867 -0.325043
C  -3.061991 2.344255 -0.574717
C  -2.429013 -1.907212 -1.1439
C  2.881315 -0.526894 0.083551
C  4.81263 -1.860058 -0.095586
H  2.035285 2.228488 0.356759
H  0.982515 1.775047 1.686893
H  0.32699 2.670978 0.318327
H  1.066538 -1.287001 -0.863448
H  -2.338622 2.666055 -1.323686
H  -2.863077 2.852276 0.369343
H  -4.062166 2.605195 -0.91074
H  -1.672224 -1.623326 -1.875462
H  -3.41395 -1.616658 -1.507466
H  -2.402437 -2.985882 -1.012625
H  5.074271 -2.799217 -0.576037
H  4.967011 -1.954447 0.979897
H  5.45713 -1.070179 -0.483116
elementType: P O C H
totalener: -1067.48914111 hartree
nucrepener: 1119.05101409 hartree
electener: -2186.54015520 hartree
oneelecener: -3689.79132547 hartree
twoeener: 1503.25117027 hartree
cpcmener: -0.03123510 hartree
kineticenergy: 1063.63673729 hartree
xcener: -82.897599612844 hartree
chargesum: -0.0000000
charge: 0.925603 -0.346284 -0.334195 -0.344577 -0.605571 -0.285010 -0.475430 0.256168 -0.236932 -0.263171 -0.112806 -0.110639 0.484400 -0.124185 0.114223 0.117143 0.110369 0.131511 0.122185 0.120843 0.130458 0.117175 0.123543 0.128125 0.126820 0.114961 0.115275
qa: 0.9256 -0.3463 -0.3342 -0.3446 -0.6056 -0.2850 -0.4754 0.2562 -0.2369 -0.2632 -0.1128 -0.1106 0.4844 -0.1242 0.1142 0.1171 0.1104 0.1315 0.1222 0.1208 0.1305 0.1172 0.1235 0.1281 0.1268 0.1150 0.1153
va: 5.6071 2.0643 2.0953 2.1170 2.0055 2.1153 2.0303 3.7389 3.9466 3.9725 3.8357 3.8365 4.1245 3.8686 1.0141 1.0066 1.0046 1.0181 0.9904 0.9916 0.9904 0.9898 0.9933 0.9898 0.9944 0.9942 0.9930
dispcorr: -0.010602692 hartree
energy: -1067.499743803841
dipole: 4.52262 -4.99351 -0.47088 1.28171 -1.42600 -0.14429 -5.29491 2.82005 -2.47487
magnitude: 2.52339 au
magnitude: 6.41396 debye
