program: Orca
programVersion: 5.0.2
elementType: P O O O O O O C C C C C C C H H H H H H H H H H H H H
charge: 0
multiplicity: 1
keywords: wb97x-d3
keywords: def2-TZVPP
keywords: def2/J RIJCOSX
keywords: DEFGRID2
keywords: scfconv7
keywords: smallprint printgap noloewdin
keywords: NOSOSCF
formula: C7H13O6P
InChI: InChI=1/C7H13O6P/c1-6(5-7(8)10-2)13-14(9,11-3)12-4/h5H,1-4H3
27 atoms
P  -1.828792 0.33394 0.362343
O  -0.584277 0.635526 -0.639042
O  -3.042473 0.728397 -0.590102
O  -1.948685 -1.244787 0.421226
O  -1.726533 0.977066 1.672815
O  3.247416 -1.8318 -0.132461
O  3.598487 0.285937 0.480557
C  0.716809 0.688009 -0.187934
C  1.119636 2.032123 0.296037
C  1.437846 -0.432806 -0.286762
C  -3.357843 2.096326 -0.825309
C  -2.180218 -2.053823 -0.724324
C  2.857307 -0.569099 0.070408
C  4.600883 -2.134114 0.165347
H  2.172913 2.077444 0.544763
H  0.531662 2.290873 1.178733
H  0.900012 2.77825 -0.470191
H  0.957575 -1.323326 -0.671292
H  -4.339642 2.121461 -1.291593
H  -2.633151 2.553283 -1.500695
H  -3.391995 2.664557 0.104777
H  -2.015263 -3.08414 -0.418948
H  -1.495302 -1.815369 -1.540124
H  -3.205206 -1.946961 -1.078808
H  4.83365 -1.954185 1.215417
H  5.289546 -1.550214 -0.446443
H  4.727335 -3.190308 -0.056751
totalener: -1067.47426731 hartree
nucrepener: 1121.00371721 hartree
electener: -2188.47798452 hartree
oneelecener: -3693.20499752 hartree
twoeener: 1504.72701300 hartree
kineticenergy: 1063.69832643 hartree
xcener: -82.901991470318 hartree
chargesum: -0.0000000
charge: 0.882653 -0.358237 -0.326406 -0.316796 -0.501560 -0.270161 -0.388617 0.268918 -0.233918 -0.254951 -0.126317 -0.129554 0.432337 -0.127771 0.118775 0.114766 0.086972 0.102872 0.115798 0.112123 0.120191 0.123180 0.101935 0.119702 0.110219 0.108188 0.115659
qa: 0.8827 -0.3582 -0.3264 -0.3168 -0.5016 -0.2702 -0.3886 0.2689 -0.2339 -0.2550 -0.1263 -0.1296 0.4323 -0.1278 0.1188 0.1148 0.0870 0.1029 0.1158 0.1121 0.1202 0.1232 0.1019 0.1197 0.1102 0.1082 0.1157
va: 5.6265 2.0664 2.0930 2.1302 2.1279 2.1137 2.1162 3.6992 3.9416 3.9661 3.8673 3.8732 4.2050 3.8983 1.0345 1.0150 1.0033 1.0272 0.9910 0.9898 0.9946 0.9881 0.9906 0.9945 0.9955 0.9957 0.9933
dispcorr: -0.010409657 hartree
energy: -1067.484676968022
dipole: 3.77460 -4.26407 -0.48947 -0.57299 0.07623 -0.49676 -4.88160 3.37396 -1.50764
magnitude: 1.66112 au
magnitude: 4.22224 debye
