program: Orca
programVersion: 5.0.3
elementType: S O O N N C C C C C H H H H H H H H H H
charge: 0
multiplicity: 1
keywords: wb97x-d3
keywords: def2-TZVPP
keywords: def2/J RIJCOSX
keywords: DEFGRID2
keywords: scfconv7
keywords: smallprint printgap noloewdin
keywords: NOSOSCF
formula: C5H10N2O2S
InChI: InChI=1/C5H10N2O2S/c1-4(10-3)7-9-5(8)6-2/h6H,1-3H3
20 atoms
S  2.955723 -0.087874 0.003306
O  -0.836125 0.562411 0.010698
O  -1.880523 -1.455363 -0.052533
N  -3.029281 0.511747 0.019025
N  0.358642 -0.134049 0.007215
C  1.362559 0.644886 0.00864
C  1.399198 2.138227 0.006733
C  -4.367087 -0.025084 0.003159
C  -1.928156 -0.249148 -0.011151
C  2.58851 -1.851292 -0.011935
H  1.870152 2.496794 -0.909708
H  1.999738 2.499922 0.842149
H  0.412352 2.585723 0.079364
H  -2.923717 1.513829 0.055729
H  -4.913822 0.316667 -0.876151
H  -4.918231 0.282026 0.892249
H  -4.334245 -1.110416 -0.017622
H  3.551067 -2.360214 -0.021061
H  2.031627 -2.135803 -0.901964
H  2.039839 -2.152445 0.877688
elementType: S O N C H
totalener: -854.74344235 hartree
nucrepener: 621.14374843 hartree
electener: -1475.88719078 hartree
oneelecener: -2405.22612286 hartree
twoeener: 929.33893209 hartree
cpcmener: -0.02563088 hartree
kineticenergy: 852.16975834 hartree
xcener: -61.814317509785 hartree
chargesum: 0.0000000
charge: -0.055246 -0.218263 -0.499033 -0.225959 -0.208319 0.153287 -0.218401 -0.141505 0.467350 -0.248323 0.114634 0.110604 0.104847 0.177627 0.110093 0.110268 0.101798 0.129364 0.117461 0.117715
qa: -0.0552 -0.2183 -0.4990 -0.2260 -0.2083 0.1533 -0.2184 -0.1415 0.4674 -0.2483 0.1146 0.1106 0.1048 0.1776 0.1101 0.1103 0.1018 0.1294 0.1175 0.1177
va: 2.3855 2.0338 2.0181 3.1804 2.8153 3.9748 3.9019 3.8733 4.3764 3.9788 1.0045 1.0065 1.0178 1.0090 0.9909 0.9911 1.0199 1.0001 1.0075 1.0073
dispcorr: -0.005382752 hartree
energy: -854.748825101338
dipole: -4.84948 4.42483 -0.42465 1.92150 -0.01794 1.90356 0.03213 0.01820 0.05032
magnitude: 1.95100 au
magnitude: 4.95904 debye
