program: Orca
programVersion: 5.0.3
elementType: S O O N N C C C C C H H H H H H H H H H
charge: 0
multiplicity: 1
keywords: wb97x-d3
keywords: def2-TZVPP
keywords: def2/J RIJCOSX
keywords: DEFGRID2
keywords: scfconv7
keywords: smallprint printgap noloewdin
keywords: NOSOSCF
formula: C5H10N2O2S
InChI: InChI=1/C5H10N2O2S/c1-4(10-3)7-9-5(8)6-2/h6H,1-3H3
20 atoms
S  2.970175 -0.083181 0.000783
O  -0.810745 0.549505 -0.003421
O  -1.893675 -1.454274 0.020825
N  -3.006167 0.536411 -0.007098
N  0.372823 -0.159963 -0.003054
C  1.37226 0.622927 -0.001793
C  1.348711 2.120542 -0.000569
C  -4.346367 0.014784 -0.00314
C  -1.911592 -0.258729 0.006435
C  2.596977 -1.846315 0.00078
H  0.825277 2.496169 -0.879609
H  2.355107 2.534162 -0.00145
H  0.827522 2.494577 0.880532
H  -2.87428 1.532223 -0.022369
H  -4.304648 -1.070239 0.013104
H  -4.896079 0.321305 -0.894577
H  -4.900339 0.347569 0.876154
H  3.55479 -2.362383 0.004775
H  2.034105 -2.125772 -0.886201
H  2.027428 -2.124254 0.883943
totalener: -854.72892252 hartree
nucrepener: 622.38705516 hartree
electener: -1477.11597768 hartree
oneelecener: -2407.23691495 hartree
twoeener: 930.12093727 hartree
kineticenergy: 852.20983887 hartree
xcener: -61.815649741608 hartree
chargesum: -0.0000000
charge: -0.036253 -0.219032 -0.370953 -0.242687 -0.182304 0.166359 -0.239221 -0.147987 0.424474 -0.253942 0.104325 0.087994 0.104658 0.135849 0.111721 0.098709 0.098712 0.112542 0.123369 0.123666
qa: -0.0363 -0.2190 -0.3710 -0.2427 -0.1823 0.1664 -0.2392 -0.1480 0.4245 -0.2539 0.1043 0.0880 0.1047 0.1358 0.1117 0.0987 0.0987 0.1125 0.1234 0.1237
va: 2.3962 2.0240 2.1538 3.1376 2.8041 3.9407 3.9561 3.8797 4.4029 3.9775 1.0011 1.0144 1.0011 1.0362 1.0244 0.9908 0.9907 1.0010 1.0092 1.0092
dispcorr: -0.005482424 hartree
energy: -854.734404944934
dipole: -5.06732 4.74444 -0.32287 2.02186 -0.75690 1.26496 -0.03297 0.01742 -0.01554
magnitude: 1.30561 au
magnitude: 3.31859 debye
