program: Orca
programVersion: 5.0.3
elementType: S O O N C C C C C C C C C C C H H H H H H H H H H H H H H H
charge: 0
multiplicity: 1
keywords: wb97x-d3
keywords: def2-TZVPP
keywords: def2/J RIJCOSX
keywords: DEFGRID2
keywords: scfconv7
keywords: smallprint printgap noloewdin
keywords: NOSOSCF
formula: C11H15NO2S
InChI: InChI=1/C11H15NO2S/c1-7-5-9(14-11(13)12-3)6-8(2)10(7)15-4/h5-6,12H,1-4H3
30 atoms
S  3.632278 -0.003161 0.032186
O  -2.208938 0.106567 0.933654
O  -2.717802 -0.08477 -1.262872
N  -4.331112 0.176647 0.311072
C  1.148589 1.175619 -0.059335
C  1.224689 -1.116232 0.775144
C  1.868565 0.013334 0.25276
C  -0.225855 1.191604 0.151801
C  -0.153488 -1.073669 0.966825
C  -0.85917 0.073013 0.659933
C  1.81624 2.398028 -0.613992
C  1.973405 -2.3674 1.122714
C  3.757318 -0.78886 -1.596517
C  -3.071719 0.052653 -0.113025
C  -5.446621 0.102129 -0.601091
H  -0.797727 2.083953 -0.073184
H  -0.673491 -1.935513 1.367664
H  1.082944 3.174911 -0.82713
H  2.546532 2.811045 0.08256
H  2.350122 2.180852 -1.53992
H  1.314541 -3.094365 1.595958
H  2.400284 -2.841889 0.23749
H  2.800245 -2.166898 1.803636
H  3.240375 -0.206819 -2.35743
H  3.363636 -1.803751 -1.583893
H  4.815511 -0.833078 -1.853304
H  -4.511279 0.249551 1.299565
H  -5.569618 -0.89701 -1.021783
H  -5.340509 0.811917 -1.420675
H  -6.351362 0.353719 -0.055109
elementType: S O N C H
totalener: -1031.71421954 hartree
nucrepener: 1097.41145565 hartree
electener: -2129.12567519 hartree
oneelecener: -3591.16293332 hartree
twoeener: 1462.03725813 hartree
cpcmener: -0.02514889 hartree
kineticenergy: 1028.23879405 hartree
xcener: -80.632970268018 hartree
chargesum: 0.0000000
charge: -0.150081 -0.339062 -0.513444 -0.227354 0.111319 0.099884 -0.182759 -0.222799 -0.239222 0.300356 -0.216674 -0.224078 -0.267954 0.511364 -0.161187 0.133728 0.129814 0.093114 0.100961 0.097523 0.094575 0.103522 0.101002 0.113407 0.113500 0.124591 0.182416 0.113083 0.108137 0.112318
qa: -0.1501 -0.3391 -0.5134 -0.2274 0.1113 0.0999 -0.1828 -0.2228 -0.2392 0.3004 -0.2167 -0.2241 -0.2680 0.5114 -0.1612 0.1337 0.1298 0.0931 0.1010 0.0975 0.0946 0.1035 0.1010 0.1134 0.1135 0.1246 0.1824 0.1131 0.1081 0.1123
va: 2.2253 2.0646 2.0008 3.1917 3.5819 3.5953 3.9025 4.0654 4.0974 3.6857 3.9077 3.8911 3.9724 4.2725 3.9052 1.0088 1.0120 1.0077 0.9998 0.9972 1.0074 0.9931 1.0061 0.9968 0.9966 0.9988 1.0096 0.9889 0.9938 0.9979
dispcorr: -0.011837900 hartree
energy: -1031.726057442134
dipole: 0.29922 -1.50902 -1.20980 -1.76327 1.63781 -0.12545 -4.52431 5.11077 0.58646
magnitude: 1.35030 au
magnitude: 3.43218 debye
