program: Orca
programVersion: 5.0.3
elementType: S O O N C C C C C C C C C C C H H H H H H H H H H H H H H H
charge: 0
multiplicity: 1
keywords: wb97x-d3
keywords: def2-TZVPP
keywords: def2/J RIJCOSX
keywords: DEFGRID2
keywords: scfconv7
keywords: smallprint printgap noloewdin
keywords: NOSOSCF
formula: C11H15NO2S
InChI: InChI=1/C11H15NO2S/c1-7-5-9(14-11(13)12-3)6-8(2)10(7)15-4/h5-6,12H,1-4H3
30 atoms
S  3.641602 -0.016723 0.066179
O  -2.2156 -0.069914 0.851443
O  -2.756389 0.295906 -1.322358
N  -4.342336 0.114805 0.300503
C  1.131099 1.097984 -0.090872
C  1.254653 -1.15753 0.81793
C  1.876987 -0.031127 0.269267
C  -0.246706 1.080848 0.082564
C  -0.126448 -1.14913 0.974001
C  -0.864512 -0.03991 0.606537
C  1.783553 2.324501 -0.657531
C  2.038669 -2.367393 1.235182
C  3.764614 -0.685878 -1.61488
C  -3.0818 0.129942 -0.179356
C  -5.493126 0.213813 -0.558289
H  -0.830562 1.948611 -0.192958
H  -0.632233 -2.011132 1.390821
H  1.045227 3.100913 -0.852273
H  2.533099 2.728834 0.021925
H  2.294419 2.11238 -1.597239
H  1.380258 -3.139471 1.631346
H  2.592913 -2.799512 0.401521
H  2.771847 -2.12058 2.002501
H  3.250392 -0.050015 -2.332967
H  3.356701 -1.693397 -1.671919
H  4.821726 -0.721848 -1.873837
H  -4.476864 -0.109004 1.270789
H  -5.891129 -0.763679 -0.839293
H  -5.224338 0.743867 -1.467761
H  -6.279492 0.776011 -0.057202
totalener: -1031.69643968 hartree
nucrepener: 1096.97512581 hartree
electener: -2128.67156548 hartree
oneelecener: -3589.60397616 hartree
twoeener: 1460.93241067 hartree
kineticenergy: 1028.27952679 hartree
xcener: -80.636691499646 hartree
chargesum: 0.0000000
charge: -0.111404 -0.332648 -0.389204 -0.238883 0.089827 0.102169 -0.187681 -0.128578 -0.208563 0.282933 -0.206037 -0.208068 -0.269544 0.445582 -0.146709 0.093872 0.099786 0.079495 0.102048 0.088117 0.078569 0.088360 0.103691 0.103413 0.101120 0.115047 0.142740 0.102111 0.110597 0.097841
qa: -0.1114 -0.3326 -0.3892 -0.2389 0.0898 0.1022 -0.1877 -0.1286 -0.2086 0.2829 -0.2060 -0.2081 -0.2695 0.4456 -0.1467 0.0939 0.0998 0.0795 0.1020 0.0881 0.0786 0.0884 0.1037 0.1034 0.1011 0.1150 0.1427 0.1021 0.1106 0.0978
va: 2.2441 2.0675 2.1316 3.1578 3.6569 3.6420 3.9659 4.0285 4.0988 3.8468 3.9201 3.9211 3.9939 4.3297 3.8978 1.0240 1.0197 1.0099 1.0016 0.9979 1.0081 0.9980 1.0010 0.9978 0.9979 1.0021 1.0330 0.9892 1.0144 0.9956
dispcorr: -0.011747624 hartree
energy: -1031.708187302349
dipole: 0.36737 -1.29651 -0.92913 -1.59888 1.31445 -0.28443 -4.24244 4.59408 0.35164
magnitude: 1.03336 au
magnitude: 2.62660 debye
