program: Orca
programVersion: 5.0.2
elementType: S S S P O O O O N N C C C C C C H H H H H H H H H H H
charge: 0
multiplicity: 1
keywords: wb97x-d3
keywords: def2-TZVPP
keywords: def2/J RIJCOSX
keywords: DEFGRID2
keywords: scfconv7
keywords: smallprint printgap noloewdin
keywords: NOSOSCF
formula: C6H11N2O4PS3
InChI: InChI=1/C6H11N2O4PS3/c1-10-5-7-8(6(9)16-5)4-15-13(14,11-2)12-3/h4H2,1-3H3
27 atoms
S  1.071399 -0.378859 -1.799318
S  -2.593159 0.147805 1.521156
S  3.650893 0.456364 0.023954
P  1.811287 -0.083623 0.127732
O  1.441486 -1.374941 0.989022
O  0.801297 0.906637 0.870464
O  -2.879227 2.417442 0.256065
O  -1.46406 -2.213781 1.024253
N  -1.404665 -0.569705 -0.596688
N  -1.777176 0.716755 -0.85029
C  -0.543852 -1.215188 -1.536673
C  -1.708272 -1.102152 0.617593
C  -2.388847 1.205877 0.15674
C  2.049438 -2.641463 0.712965
C  0.827736 2.305642 0.560063
C  -2.676221 3.295805 -0.858264
H  -0.385878 -2.243595 -1.225772
H  -1.003649 -1.22685 -2.524842
H  3.136725 -2.561496 0.70215
H  1.705969 -3.043403 -0.240748
H  1.746431 -3.311202 1.512827
H  0.67943 2.480781 -0.505835
H  1.771201 2.752256 0.87272
H  0.013241 2.761236 1.11657
H  -3.123241 4.241964 -0.570309
H  -3.170548 2.912641 -1.750464
H  -1.613856 3.436679 -1.056272
elementType: S P O N C H
totalener: -2181.77947604 hartree
nucrepener: 1860.88663981 hartree
electener: -4042.66611584 hartree
oneelecener: -6710.48133715 hartree
twoeener: 2667.81522131 hartree
cpcmener: -0.03272247 hartree
kineticenergy: 2176.46171777 hartree
xcener: -133.454934362831 hartree
chargesum: 0.0000000
charge: -0.148591 0.044973 -0.432432 0.613415 -0.330587 -0.329082 -0.285171 -0.475068 0.048141 -0.298755 -0.043697 0.270465 0.275219 -0.115620 -0.132212 -0.110577 0.141944 0.167470 0.119999 0.117493 0.134370 0.118602 0.135044 0.133261 0.136179 0.124096 0.121117
qa: -0.1486 0.0450 -0.4324 0.6134 -0.3306 -0.3291 -0.2852 -0.4751 0.0481 -0.2988 -0.0437 0.2705 0.2752 -0.1156 -0.1322 -0.1106 0.1419 0.1675 0.1200 0.1175 0.1344 0.1186 0.1350 0.1333 0.1362 0.1241 0.1211
va: 2.2747 2.5515 2.0492 5.4666 2.0969 2.0850 2.1165 2.0295 3.1659 2.8184 3.9275 4.3203 4.1832 3.8383 3.8310 3.8281 1.0153 0.9941 1.0048 0.9866 0.9894 0.9934 1.0053 0.9874 0.9914 0.9943 0.9882
dispcorr: -0.016295405 hartree
energy: -2181.795771440803
dipole: -1.72777 -0.05468 -1.78245 4.91876 -3.73289 1.18588 -4.06848 2.74909 -1.31939
magnitude: 2.51480 au
magnitude: 6.39211 debye
