program: Orca
programVersion: 5.0.2
elementType: S S S P O O O O N N C C C C C C H H H H H H H H H H H
charge: 0
multiplicity: 1
keywords: wb97x-d3
keywords: def2-TZVPP
keywords: def2/J RIJCOSX
keywords: DEFGRID2
keywords: scfconv7
keywords: smallprint printgap noloewdin
keywords: NOSOSCF
formula: C6H11N2O4PS3
InChI: InChI=1/C6H11N2O4PS3/c1-10-5-7-8(6(9)16-5)4-15-13(14,11-2)12-3/h4H2,1-3H3
27 atoms
S  1.082442 -0.211232 -1.833686
S  -2.667853 0.000207 1.331181
S  3.538784 0.894434 0.061446
P  1.829554 0.01897 0.089758
O  1.763901 -1.420724 0.79228
O  0.62943 0.768728 0.83312
O  -3.155059 2.150125 -0.082559
O  -1.233075 -2.224898 1.015976
N  -1.379159 -0.722454 -0.730125
N  -1.874679 0.502695 -1.063974
C  -0.387461 -1.28512 -1.592826
C  -1.616233 -1.189848 0.526363
C  -2.546264 0.989336 -0.095481
C  2.712025 -2.438256 0.455326
C  0.748638 1.160392 2.209324
C  -3.005518 2.968705 -1.249945
H  -0.09344 -2.260925 -1.217253
H  -0.788653 -1.414603 -2.597441
H  2.474663 -3.301947 1.070133
H  3.72977 -2.111032 0.668233
H  2.635404 -2.715819 -0.59705
H  0.605666 0.304234 2.866941
H  -0.029918 1.895005 2.393788
H  1.720013 1.615054 2.406713
H  -3.42866 2.479549 -2.126814
H  -1.956053 3.201251 -1.428971
H  -3.5527 3.882332 -1.040684
elementType: S P O N C H
totalener: -2181.77832770 hartree
nucrepener: 1848.91134645 hartree
electener: -4030.68967415 hartree
oneelecener: -6686.96989677 hartree
twoeener: 2656.28022262 hartree
cpcmener: -0.03060634 hartree
kineticenergy: 2176.46384431 hartree
xcener: -133.452640912572 hartree
chargesum: -0.0000000
charge: -0.137730 0.027497 -0.436279 0.605645 -0.325562 -0.330045 -0.287367 -0.471378 0.041845 -0.303227 -0.044771 0.271952 0.297515 -0.107094 -0.118089 -0.105729 0.143535 0.168544 0.131616 0.117184 0.113703 0.131868 0.124656 0.117855 0.119916 0.119136 0.134802
qa: -0.1377 0.0275 -0.4363 0.6056 -0.3256 -0.3300 -0.2874 -0.4714 0.0418 -0.3032 -0.0448 0.2720 0.2975 -0.1071 -0.1181 -0.1057 0.1435 0.1685 0.1316 0.1172 0.1137 0.1319 0.1247 0.1179 0.1199 0.1191 0.1348
va: 2.2863 2.5224 2.0454 5.4464 2.0596 2.0890 2.1263 2.0325 3.1834 2.8349 3.9345 4.3153 4.1707 3.8397 3.8291 3.8247 1.0183 0.9926 0.9898 1.0040 0.9904 0.9873 0.9863 1.0097 0.9950 0.9961 0.9917
dispcorr: -0.015170121 hartree
energy: -2181.793497821887
dipole: -0.31551 -1.19956 -1.51507 1.05855 -0.81070 0.24785 0.08812 -0.58669 -0.49857
magnitude: 1.61414 au
magnitude: 4.10281 debye
