program: Orca
programVersion: 5.0.2
elementType: S S S P O O O O N N C C C C C C H H H H H H H H H H H
charge: 0
multiplicity: 1
keywords: wb97x-d3
keywords: def2-TZVPP
keywords: def2/J RIJCOSX
keywords: DEFGRID2
keywords: scfconv7
keywords: smallprint printgap noloewdin
keywords: NOSOSCF
formula: C6H11N2O4PS3
InChI: InChI=1/C6H11N2O4PS3/c1-10-5-7-8(6(9)16-5)4-15-13(14,11-2)12-3/h4H2,1-3H3
27 atoms
S  0.891885 -1.628255 0.075411
S  -3.461002 -0.107669 -1.754983
S  1.274418 1.109064 2.122409
P  2.098033 -0.135852 0.914685
O  2.84251 0.5084 -0.356794
O  3.276991 -1.047476 1.489331
O  -2.382646 2.287855 -1.671084
O  -2.946821 -2.476487 -0.607204
N  -1.647068 -0.653762 -0.059206
N  -1.43771 0.655247 -0.358497
C  -0.737639 -1.296425 0.832536
C  -2.646952 -1.322391 -0.70957
C  -2.301011 1.062848 -1.199414
C  2.154155 1.430372 -1.186186
C  4.384915 -0.448168 2.156064
C  -1.434408 3.220999 -1.163072
H  -0.591675 -0.683198 1.721995
H  -1.155506 -2.259213 1.114085
H  1.861949 2.319341 -0.624145
H  1.26185 0.976102 -1.622964
H  2.839207 1.711414 -1.982413
H  4.920955 -1.251154 2.655068
H  4.052938 0.278073 2.899707
H  5.051284 0.041015 1.445036
H  -1.48212 3.285486 -0.075504
H  -1.692897 4.17792 -1.606383
H  -0.41908 2.944737 -1.44952
totalener: -2181.76557090 hartree
nucrepener: 1775.90811676 hartree
electener: -3957.67368766 hartree
oneelecener: -6540.07402424 hartree
twoeener: 2582.40033658 hartree
kineticenergy: 2176.53114232 hartree
xcener: -133.460039728720 hartree
chargesum: 0.0000000
charge: -0.130077 0.027569 -0.392304 0.627055 -0.315717 -0.311991 -0.265678 -0.353060 0.042812 -0.281041 -0.074733 0.234819 0.255638 -0.104013 -0.131080 -0.107352 0.148358 0.142321 0.103925 0.091930 0.117240 0.117947 0.105706 0.116521 0.118868 0.126953 0.089386
qa: -0.1301 0.0276 -0.3923 0.6271 -0.3157 -0.3120 -0.2657 -0.3531 0.0428 -0.2810 -0.0747 0.2348 0.2556 -0.1040 -0.1311 -0.1074 0.1484 0.1423 0.1039 0.0919 0.1172 0.1179 0.1057 0.1165 0.1189 0.1270 0.0894
va: 2.2868 2.5295 2.0657 5.4028 2.0992 2.1446 2.1340 2.1675 3.1330 2.8592 3.8908 4.3377 4.1935 3.8865 3.8820 3.8637 1.0428 1.0224 1.0005 0.9967 0.9955 0.9899 1.0031 0.9897 0.9988 0.9938 1.0022
dispcorr: -0.013151972 hartree
energy: -2181.778722875779
dipole: 11.87738 -11.00506 0.87231 10.72232 -9.30670 1.41562 1.29856 -1.59404 -0.29548
magnitude: 1.68885 au
magnitude: 4.29272 debye
