program: Gaussian 09
title: 000058625
version: EM64L-G09RevD.01
frameworkgroup: C1[X(C13H20ClN3O)]
method: RPBEPBE
basis: SDD
operation: Freq
keyword: #p
keyword: freq=noraman
keyword: PBEPBE/SDD
title: #p freq=noraman PBEPBE/SDD
converged: YES YES NO NO
title: Mulliken charges:
elementType: Cl O N N N C C C C C C C C C C C C C H H H H H H H H H H H H H H H H H H H H
charge: -0.075876 -0.221546 -0.055671 -0.087397 -0.447324 -0.341739 -0.362299 -0.475573 -0.638372 0.173767 -0.615038 -0.616230 0.599702 -0.356603 -0.324639 -0.221207 -0.222967 -0.241595 0.197476 0.203687 0.206006 0.207401 0.183835 0.249942 0.228130 0.257076 0.184420 0.219366 0.190902 0.222100 0.220073 0.189034 0.225453 0.307667 0.313739 0.255113 0.233286 0.235901
chargesum: 0.00000
title: Mulliken charges with hydrogens summed into heavy atoms:
elementType: Cl O N N N C C C C C C C C C C C C C
charge: -0.075876 -0.221546 -0.055671 -0.087397 -0.139657 0.059424 0.051108 -0.041796 0.031253 0.173767 0.017330 0.018331 0.599702 -0.356603 -0.010901 0.033907 0.010319 -0.005693
polarizability: 2.57580462e+02 5.07442030e+00 1.74192623e+02 2.09232802e+00 3.96939408e+00 1.10525036e+02
1716.lowfreq: -23.1489 -9.2514 -0.0025 -0.0019 -0.0016 2.2671 4.4536 15.3795 17.6645
frequency: -21.6005 15.0479 17.4010 44.7472 66.0886 79.0694 90.9327 121.6921 125.3347 161.6118 166.2088 203.3974 211.4667 217.2217 240.9861 250.3964 282.9150 297.2755 307.7983 329.8095 352.6611 370.5602 416.7612 424.3557 439.7861 446.6999 491.5488 533.7514 578.4154 602.7629 665.8616 694.5167 726.1713 743.0212 761.3507 788.5927 804.3022 829.2130 860.7494 873.6748 927.9746 949.9143 971.4857 997.0531 1006.2435 1026.7146 1034.0287 1037.7998 1046.7739 1054.8756 1077.7773 1090.6916 1111.1333 1124.9884 1132.6646 1144.3264 1162.5303 1171.3586 1176.8144 1239.7911 1243.5226 1255.9024 1269.0129 1286.8581 1302.5395 1305.9990 1331.7203 1355.4198 1369.5985 1391.8755 1420.5227 1425.8131 1433.1262 1441.2369 1443.5686 1455.8588 1460.8487 1465.0830 1471.0570 1472.7565 1477.0360 1480.2868 1485.0338 1487.3617 1510.0454 1576.5954 1611.3136 1638.5782 2776.0083 2847.2274 2856.4289 2858.0396 2874.8861 2891.0398 3000.9665 3016.2464 3017.6261 3026.9318 3041.6007 3046.8786 3075.1337 3082.5801 3099.6659 3142.1000 3158.7072 3176.1675 3192.4886 3469.9262
redmass: 2.6440 4.4110 4.4304 4.5996 3.9306 5.4532 2.1524 3.1530 3.6310 3.6911 5.0483 1.9517 1.4046 1.1815 1.4200 3.9128 4.3496 2.8089 2.9971 2.5697 2.7105 5.5945 6.8879 2.2982 3.4013 3.0545 3.3864 3.5624 4.2540 4.8547 6.9900 1.3283 2.9100 4.9808 1.2599 1.4131 3.5621 3.9775 4.5935 1.3468 5.9454 1.3566 2.0947 1.3144 6.9796 2.3935 1.5359 2.0542 1.6866 2.0839 2.3632 1.3316 1.3055 1.6580 1.6232 1.9610 2.6068 1.0686 1.5841 2.2993 1.5953 1.7845 1.9174 1.6568 1.2699 1.9029 1.5056 1.5599 3.7515 1.4093 1.1433 2.5292 1.1305 1.1476 1.1374 2.3515 1.0500 1.0796 1.0634 1.0744 1.0565 1.0780 1.0495 1.0586 2.3138 5.2469 7.0162 5.4553 1.0707 1.0570 1.0583 1.0583 1.0682 1.0685 1.0834 1.0725 1.0852 1.0732 1.0909 1.0733 1.1007 1.1001 1.1004 1.0866 1.0920 1.0983 1.0956 1.0758
irintensity: 0.8235 0.0802 0.1900 4.1152 0.8961 2.2519 0.4153 2.0843 5.0113 0.1537 0.2211 3.6942 0.1504 0.1340 0.6195 0.9578 2.4417 1.9096 1.8093 4.4507 19.4861 6.8222 2.7808 0.4294 10.8700 11.6676 2.0963 4.1137 8.4914 2.1388 24.7184 44.4196 4.2301 7.6545 114.8932 14.7876 9.3143 4.8960 4.5137 4.1627 19.8896 5.4489 4.4219 2.9592 51.2975 52.3090 24.2069 1.5142 74.4717 34.3306 0.8257 5.2918 2.1801 14.5112 50.0832 35.4373 57.9850 0.4237 21.2607 3.3048 7.6624 23.0843 4.8036 14.4257 4.5806 55.2232 21.4880 39.3280 88.4590 2.5576 2.7275 92.3393 13.0612 4.3712 2.9908 16.4063 14.3456 5.6597 6.5972 14.9130 7.8505 6.5261 16.6408 28.4318 499.5118 17.8479 107.1388 75.4846 147.9202 72.7601 140.1706 116.6494 13.7316 205.1176 11.7350 42.7812 6.5784 47.8339 48.4225 34.9329 38.4724 55.7133 32.8489 3.7833 11.7656 9.2522 11.4840 32.6629
temp: 298.150 k
press: 1.00000 atm
elementType: 17 8 7 7 7 6 6 6 6 6 6 6 6 6 6 6 6 6 1 1 1 1 1 1 1 1 1 1 1 1 1 1 1 1 1 1 1 1
symmnumber: 1
zpe: 823260.0 jmol-1
zpe.correction: 0.313563 hartree
zpe.thermalcorrener: 0.332529 hartree
zpe.thermalcorrenthalpy: 0.333473 hartree
zpe.thermalcorrgfe: 0.263765 hartree
zpe.sumelectzpe: -1205.503301 hartree
zpe.sumelectthermal: -1205.484335 hartree
zpe.sumelectthermalent: -1205.483391 hartree
zpe.sumelectthermalfe: -1205.553099 hartree
dipole: -0.1290 1.2981 0.1112
dipole: 1.3092
quadrupole: -96.6489 -120.1776 -115.8364
quadrupole: 2.7746 -0.1273 -2.0791
quadrupole: 14.2388 -9.2900 -4.9488 2.7746 -0.1273 -2.0791
hfenergy: -1205.8168643 hartree
pointgroup: C01 [X(C13H20Cl1N3O1)]
dipole: 0.0298856 -0.5045616 0.0992196 debye
polarizability: 257.8482532|1.3615174|172.3256658|-2.6507026|-10.6503995|112.1242031 unknown
InChI: InChI=1S/C13H20ClN3O/c1-16(2)8-9-17(3)10-13(18)15-12-7-5-4-6-11(12)14/h4-7,15H,8-10H2,1-3H3
charge 0 multiplicity 1
38 atoms
Cl 3.523716 -2.720742 0.500917
O  0.394176 1.542261 -0.337291
N  -2.037949 0.160196 0.465726
N  -5.786997 -0.308715 -0.121241
N  1.578113 -0.451842 0.047525
C  -3.313098 -0.549205 0.205847
C  -4.527042 0.407732 0.19463
C  -0.864491 -0.573566 -0.004804
C  -1.888517 0.654793 1.848045
C  0.40808 0.303128 -0.1054
C  -5.920999 -0.65073 -1.552037
C  -6.984052 0.395109 0.381937
C  2.922431 -0.02956 -0.081858
C  3.966742 -0.978377 0.101309
C  3.30141 1.308469 -0.388024
C  5.324787 -0.646027 -0.009119
C  4.664063 1.652544 -0.502375
C  5.680099 0.688078 -0.315717
H  -3.515086 -1.360049 0.948868
H  -3.229671 -1.033237 -0.785206
H  -4.314109 1.242486 -0.517951
H  -4.646725 0.859364 1.196591
H  -0.624844 -1.477064 0.624661
H  -1.072342 -0.950806 -1.026177
H  -2.746506 1.291299 2.118783
H  -0.983389 1.280702 1.919705
H  -1.817965 -0.171866 2.600576
H  -5.068846 -1.26728 -1.886024
H  -5.974804 0.250951 -2.214862
H  -6.840627 -1.243705 -1.704909
H  -7.8810 -0.225721 0.203614
H  -7.156265 1.390822 -0.101691
H  -6.893236 0.555367 1.471089
H  1.457306 -1.444014 0.280065
H  2.511427 2.048764 -0.526526
H  6.088741 -1.414133 0.141438
H  4.930573 2.688066 -0.738852
H  6.736296 0.960809 -0.404365
