program: Orca
programVersion: 5.0.2
elementType: S S S P O O O O N N C C C C C C H H H H H H H H H H H
charge: 0
multiplicity: 1
keywords: wb97x-d3
keywords: def2-TZVPP
keywords: def2/J RIJCOSX
keywords: DEFGRID2
keywords: scfconv7
keywords: smallprint printgap noloewdin
keywords: NOSOSCF
formula: C6H11N2O4PS3
InChI: InChI=1/C6H11N2O4PS3/c1-10-5-7-8(6(9)16-5)4-15-13(14,11-2)12-3/h4H2,1-3H3
27 atoms
S  0.969248 -1.449629 0.565573
S  -3.821923 -0.276557 -0.095606
S  2.208678 1.102474 -1.322377
P  2.342184 0.133481 0.327458
O  3.734575 -0.572127 0.670129
O  2.233468 0.958551 1.691168
O  -3.042886 2.229925 -0.035349
O  -2.628388 -2.642685 -0.504065
N  -1.374918 -0.713913 -0.628811
N  -1.443075 0.635091 -0.471145
C  -0.106789 -1.306699 -0.90341
C  -2.509248 -1.453459 -0.440425
C  -2.637289 0.991237 -0.212129
C  4.343311 -1.420234 -0.29387
C  1.097339 1.779356 1.916599
C  -2.063432 3.248306 -0.208254
H  -0.273405 -2.318028 -1.264588
H  0.417988 -0.724307 -1.661128
H  5.279732 -1.76186 0.138788
H  4.547048 -0.883759 -1.221435
H  3.714769 -2.286711 -0.510697
H  0.983681 2.518512 1.12189
H  1.262295 2.286827 2.863279
H  0.186132 1.181929 1.980345
H  -1.595319 3.18703 -1.191099
H  -1.28546 3.180454 0.55288
H  -2.593368 4.190408 -0.106125
totalener: -2181.76676583 hartree
nucrepener: 1778.07383243 hartree
electener: -3959.84059827 hartree
oneelecener: -6544.24416582 hartree
twoeener: 2584.40356756 hartree
kineticenergy: 2176.53064560 hartree
xcener: -133.461099533472 hartree
chargesum: 0.0000000
charge: -0.158739 0.029162 -0.384694 0.625918 -0.305216 -0.298199 -0.264858 -0.353642 0.042380 -0.285216 -0.078978 0.236096 0.257530 -0.124307 -0.115540 -0.110129 0.141417 0.151744 0.119394 0.114290 0.100071 0.102377 0.121023 0.100136 0.117918 0.093144 0.126920
qa: -0.1587 0.0292 -0.3847 0.6259 -0.3052 -0.2982 -0.2649 -0.3536 0.0424 -0.2852 -0.0790 0.2361 0.2575 -0.1243 -0.1155 -0.1101 0.1414 0.1517 0.1194 0.1143 0.1001 0.1024 0.1210 0.1001 0.1179 0.0931 0.1269
va: 2.2830 2.5314 2.0739 5.4162 2.1361 2.1427 2.1338 2.1665 3.1336 2.8536 3.8957 4.3374 4.1875 3.8736 3.8788 3.8643 1.0189 1.0442 0.9938 0.9996 0.9973 1.0013 0.9954 0.9959 0.9988 1.0000 0.9935
dispcorr: -0.013224397 hartree
energy: -2181.779990229289
dipole: 7.73362 -7.58829 0.14533 7.52357 -6.54374 0.97984 0.54976 -0.46963 0.08013
magnitude: 0.99379 au
magnitude: 2.52601 debye
