program: Orca
programVersion: 5.0.2
elementType: S S S P O O O O N N C C C C C C H H H H H H H H H H H
charge: 0
multiplicity: 1
keywords: wb97x-d3
keywords: def2-TZVPP
keywords: def2/J RIJCOSX
keywords: DEFGRID2
keywords: scfconv7
keywords: smallprint printgap noloewdin
keywords: NOSOSCF
formula: C6H11N2O4PS3
InChI: InChI=1/C6H11N2O4PS3/c1-10-5-7-8(6(9)16-5)4-15-13(14,11-2)12-3/h4H2,1-3H3
27 atoms
S  1.062405 0.037672 -1.611709
S  -3.030292 0.206718 1.17095
S  3.608549 0.937304 0.325256
P  1.991611 -0.077883 0.245485
O  2.12499 -1.649658 0.572429
O  0.795013 0.327956 1.222596
O  -3.636335 2.103145 -0.545474
O  -1.35788 -1.88464 1.202591
N  -1.451445 -0.543847 -0.67281
N  -2.054363 0.562765 -1.183472
C  -0.363518 -1.099999 -1.407764
C  -1.781148 -0.946361 0.591661
C  -2.883568 1.043638 -0.347537
C  3.210563 -2.392996 0.034989
C  0.977115 0.291563 2.637699
C  -3.487796 2.754081 -1.803529
H  -0.052968 -2.023931 -0.927448
H  -0.68165 -1.320453 -2.426419
H  3.128278 -3.401344 0.433332
H  4.168356 -1.960481 0.32634
H  3.160279 -2.433548 -1.055688
H  0.954425 -0.734417 3.002217
H  0.148517 0.845699 3.07107
H  1.916319 0.767909 2.92464
H  -2.46522 3.103739 -1.94876
H  -4.168636 3.599586 -1.781831
H  -3.751767 2.086935 -2.625055
totalener: -2181.76648827 hartree
nucrepener: 1808.77106233 hartree
electener: -3990.53755059 hartree
oneelecener: -6606.20779306 hartree
twoeener: 2615.67024247 hartree
kineticenergy: 2176.52328762 hartree
xcener: -133.458040290720 hartree
chargesum: -0.0000000
charge: -0.113542 0.022696 -0.365718 0.587045 -0.311399 -0.318974 -0.266643 -0.350816 0.033609 -0.273745 -0.083049 0.217389 0.263610 -0.123999 -0.128358 -0.119138 0.137666 0.145753 0.120894 0.117633 0.101432 0.131016 0.108604 0.116909 0.118192 0.123434 0.109497
qa: -0.1135 0.0227 -0.3657 0.5870 -0.3114 -0.3190 -0.2666 -0.3508 0.0336 -0.2737 -0.0830 0.2174 0.2636 -0.1240 -0.1284 -0.1191 0.1377 0.1458 0.1209 0.1176 0.1014 0.1310 0.1086 0.1169 0.1182 0.1234 0.1095
va: 2.2826 2.5202 2.1090 5.4446 2.0601 2.0975 2.1364 2.1655 3.1455 2.8540 3.9554 4.3704 4.1887 3.8681 3.8476 3.8589 1.0285 0.9971 0.9894 1.0071 0.9931 0.9916 0.9934 1.0075 0.9966 0.9920 0.9984
dispcorr: -0.013933789 hartree
energy: -2181.780422055324
dipole: 0.88163 -1.85796 -0.97633 -1.74622 1.59170 -0.15452 -1.52678 0.96992 -0.55686
magnitude: 1.13454 au
magnitude: 2.88378 debye
