program: Orca
programVersion: 5.0.2
elementType: S S S P O O O O N N C C C C C C H H H H H H H H H H H
charge: 0
multiplicity: 1
keywords: wb97x-d3
keywords: def2-TZVPP
keywords: def2/J RIJCOSX
keywords: DEFGRID2
keywords: scfconv7
keywords: smallprint printgap noloewdin
keywords: NOSOSCF
formula: C6H11N2O4PS3
InChI: InChI=1/C6H11N2O4PS3/c1-10-5-7-8(6(9)16-5)4-15-13(14,11-2)12-3/h4H2,1-3H3
27 atoms
S  1.092346 0.05768 -1.879941
S  -2.701524 -0.210437 1.330636
S  3.683059 0.705255 0.093351
P  2.012639 -0.214319 -0.033524
O  1.986857 -1.802754 0.110382
O  0.911411 0.200563 1.069494
O  -3.361066 2.034435 0.135928
O  -1.158025 -2.31548 0.736718
N  -1.350372 -0.594162 -0.78943
N  -1.933538 0.619693 -0.981706
C  -0.382793 -1.026153 -1.746143
C  -1.579601 -1.251496 0.388472
C  -2.654487 0.9312 0.019447
C  2.334387 -2.419472 1.350542
C  0.694696 1.573722 1.364781
C  -3.292828 2.945674 -0.956191
H  -0.083985 -2.042544 -1.507461
H  -0.817723 -1.009139 -2.745287
H  2.56614 -3.457793 1.128848
H  1.497413 -2.377217 2.045177
H  3.212381 -1.947191 1.795062
H  1.611428 2.05161 1.711781
H  -0.05797 1.610173 2.148852
H  0.325228 2.110402 0.487693
H  -2.270427 3.286053 -1.124582
H  -3.921647 3.78667 -0.680085
H  -3.665892 2.489633 -1.873772
totalener: -2181.76619383 hartree
nucrepener: 1840.31993655 hartree
electener: -4022.08613038 hartree
oneelecener: -6669.02114399 hartree
twoeener: 2646.93501361 hartree
kineticenergy: 2176.51980963 hartree
xcener: -133.459263885685 hartree
chargesum: 0.0000000
charge: -0.114436 0.023189 -0.362368 0.579602 -0.312658 -0.310542 -0.263433 -0.352465 0.027803 -0.279588 -0.081824 0.237066 0.250734 -0.108793 -0.148692 -0.116101 0.143955 0.144907 0.113174 0.117943 0.106760 0.134856 0.115665 0.106702 0.112124 0.125104 0.111316
qa: -0.1144 0.0232 -0.3624 0.5796 -0.3127 -0.3105 -0.2634 -0.3525 0.0278 -0.2796 -0.0818 0.2371 0.2507 -0.1088 -0.1487 -0.1161 0.1440 0.1449 0.1132 0.1179 0.1068 0.1349 0.1157 0.1067 0.1121 0.1251 0.1113
va: 2.2814 2.5161 2.1191 5.4515 2.1073 2.0430 2.1307 2.1639 3.1357 2.8306 3.9588 4.3446 4.1757 3.8610 3.8753 3.8608 1.0250 0.9968 0.9921 0.9938 1.0065 1.0118 0.9897 0.9876 0.9950 0.9916 0.9985
dispcorr: -0.015521742 hartree
energy: -2181.781715575092
dipole: -3.30223 1.75588 -1.54635 4.52927 -3.86777 0.66151 1.40080 -1.47105 -0.07025
magnitude: 1.68337 au
magnitude: 4.27878 debye
