program: Orca
programVersion: 5.0.2
elementType: S P O O N C C H H H H H H H H
charge: 0
multiplicity: 1
keywords: wb97x-d3
keywords: def2-TZVPP
keywords: def2/J RIJCOSX
keywords: DEFGRID2
keywords: scfconv7
keywords: smallprint printgap noloewdin
keywords: NOSOSCF
formula: C2H8NO2PS
InChI: InChI=1/C2H8NO2PS/c1-5-6(3,4)7-2/h3H2,1-2H3
15 atoms
S  -1.193402 -0.78909 0.24146
P  0.45447 0.439975 -0.071169
O  1.640354 -0.645287 -0.033119
O  0.395532 1.26713 -1.308543
N  0.602553 1.346097 1.293656
C  -2.520947 0.418073 -0.055938
C  1.819604 -1.561625 -1.119605
H  1.230066 2.139034 1.243918
H  0.64388 0.872885 2.186345
H  -3.460567 -0.125253 0.020754
H  -2.443956 0.846205 -1.051757
H  -2.507793 1.205132 0.694252
H  1.097699 -2.377169 -1.065293
H  2.822286 -1.972086 -1.029696
H  1.727698 -1.064919 -2.085866
elementType: S P O N C H
totalener: -1025.94837432 hartree
nucrepener: 517.79408405 hartree
electener: -1543.74245837 hartree
oneelecener: -2443.49107239 hartree
twoeener: 899.74861402 hartree
cpcmener: -0.02996627 hartree
kineticenergy: 1023.21040786 hartree
xcener: -62.574152339448 hartree
chargesum: 0.0000000
charge: -0.184404 0.800581 -0.372987 -0.677141 -0.346007 -0.234256 -0.103155 0.192306 0.189110 0.134838 0.123316 0.125334 0.111251 0.127363 0.113850
qa: -0.1844 0.8006 -0.3730 -0.6771 -0.3460 -0.2343 -0.1032 0.1923 0.1891 0.1348 0.1233 0.1253 0.1113 0.1274 0.1139
va: 2.2568 5.4541 2.0459 1.9183 3.0995 3.9141 3.8451 1.0086 1.0087 0.9964 1.0119 1.0063 0.9908 0.9909 0.9968
dispcorr: -0.004192710 hartree
energy: -1025.952567030597
dipole: -1.52574 1.49158 -0.03416 -0.93724 0.34905 -0.58819 -0.36549 1.73456 1.36906
magnitude: 1.49046 au
magnitude: 3.78845 debye
