program: Orca
programVersion: 5.0.2
elementType: S P O O N C C H H H H H H H H
charge: 0
multiplicity: 1
keywords: wb97x-d3
keywords: def2-TZVPP
keywords: def2/J RIJCOSX
keywords: DEFGRID2
keywords: scfconv7
keywords: smallprint printgap noloewdin
keywords: NOSOSCF
formula: C2H8NO2PS
InChI: InChI=1/C2H8NO2PS/c1-5-6(3,4)7-2/h3H2,1-2H3
15 atoms
S  -1.315072 0.074388 0.846006
P  0.445908 0.785425 -0.007743
O  0.965113 -0.404118 -0.960492
O  0.334063 2.018174 -0.830153
N  1.373308 0.964718 1.343137
C  -2.158765 -0.56325 -0.634962
C  1.302507 -1.6871 -0.431226
H  2.190515 1.554762 1.247294
H  1.55165 0.155476 1.924308
H  -3.178794 -0.793121 -0.333856
H  -1.688845 -1.47324 -1.001432
H  -2.192487 0.186913 -1.421782
H  2.225971 -1.640713 0.147851
H  1.448799 -2.354944 -1.276519
H  0.507619 -2.090391 0.1998
elementType: S P O N C H
totalener: -1025.94824641 hartree
nucrepener: 520.97922223 hartree
electener: -1546.92746864 hartree
oneelecener: -2449.52531970 hartree
twoeener: 902.59785106 hartree
cpcmener: -0.04016195 hartree
kineticenergy: 1023.20319733 hartree
xcener: -62.573849120848 hartree
chargesum: -0.0000000
charge: -0.180587 0.787052 -0.361880 -0.677059 -0.356223 -0.239844 -0.113666 0.192678 0.194901 0.135086 0.123911 0.130055 0.125368 0.130972 0.109236
qa: -0.1806 0.7871 -0.3619 -0.6771 -0.3562 -0.2398 -0.1137 0.1927 0.1949 0.1351 0.1239 0.1301 0.1254 0.1310 0.1092
va: 2.2661 5.4477 2.0057 1.9330 3.0987 3.9240 3.8316 1.0074 1.0045 0.9978 1.0007 1.0065 0.9947 0.9894 0.9950
dispcorr: -0.004681860 hartree
energy: -1025.952928271164
dipole: 0.37150 0.32777 0.69927 -8.25560 5.58248 -2.67312 -0.69381 1.84572 1.15191
magnitude: 2.99357 au
magnitude: 7.60905 debye
