program: Orca
programVersion: 5.0.2
elementType: S P O O N C C H H H H H H H H
charge: 0
multiplicity: 1
keywords: wb97x-d3
keywords: def2-TZVPP
keywords: def2/J RIJCOSX
keywords: DEFGRID2
keywords: scfconv7
keywords: smallprint printgap noloewdin
keywords: NOSOSCF
formula: C2H8NO2PS
InChI: InChI=1/C2H8NO2PS/c1-5-6(3,4)7-2/h3H2,1-2H3
15 atoms
S  -1.500278 -0.027091 -0.48886
P  0.442562 0.582327 0.020426
O  1.280985 -0.786039 0.131236
O  0.865956 1.595286 -0.957409
N  0.513487 1.023685 1.613693
C  -1.855892 -1.198954 0.852543
C  1.542215 -1.519631 -1.057691
H  0.109288 1.908004 1.87169
H  0.511755 0.335052 2.346769
H  -2.845764 -1.608578 0.662842
H  -1.872796 -0.701484 1.820453
H  -1.142097 -2.019482 0.873306
H  2.171054 -2.362005 -0.779583
H  2.067021 -0.908626 -1.792741
H  0.618553 -1.893133 -1.505622
totalener: -1025.93171434 hartree
nucrepener: 520.64164720 hartree
electener: -1546.57336154 hartree
oneelecener: -2448.52042319 hartree
twoeener: 901.94706165 hartree
kineticenergy: 1023.25489887 hartree
xcener: -62.576668131010 hartree
chargesum: 0.0000000
charge: -0.159389 0.737072 -0.344393 -0.507133 -0.323575 -0.270016 -0.123787 0.154245 0.149990 0.125568 0.101598 0.117009 0.114947 0.129045 0.098815
qa: -0.1594 0.7371 -0.3444 -0.5071 -0.3236 -0.2700 -0.1238 0.1542 0.1500 0.1256 0.1016 0.1170 0.1149 0.1290 0.0988
va: 2.2344 5.4962 2.0616 2.1340 3.1117 3.9469 3.8598 1.0324 1.0364 1.0053 1.0111 0.9997 0.9897 0.9970 0.9991
dispcorr: -0.004709799 hartree
energy: -1025.936424141268
dipole: -0.81725 0.34532 -0.47194 -7.51464 6.21066 -1.30398 3.48892 -2.16980 1.31912
magnitude: 1.91394 au
magnitude: 4.86485 debye
