program: Orca
programVersion: 5.0.2
elementType: S P O O N C C H H H H H H H H
charge: 0
multiplicity: 1
keywords: wb97x-d3
keywords: def2-TZVPP
keywords: def2/J RIJCOSX
keywords: DEFGRID2
keywords: scfconv7
keywords: smallprint printgap noloewdin
keywords: NOSOSCF
formula: C2H8NO2PS
InChI: InChI=1/C2H8NO2PS/c1-5-6(3,4)7-2/h3H2,1-2H3
15 atoms
S  -1.232138 -0.942136 0.232813
P  0.391909 0.344383 -0.098024
O  1.575575 -0.737556 -0.027099
O  0.28546 1.172843 -1.314108
N  0.635793 1.231644 1.273985
C  -2.573089 0.193696 -0.229446
C  1.820787 -1.5584 -1.16386
H  0.456323 0.852779 2.18755
H  0.553774 2.230828 1.197283
H  -2.660926 1.013361 0.480117
H  -3.495299 -0.382639 -0.213277
H  -2.411844 0.587875 -1.228866
H  2.669336 -2.192642 -0.91898
H  2.063339 -0.957241 -2.040589
H  0.961606 -2.191558 -1.396409
totalener: -1025.93301933 hartree
nucrepener: 518.26672785 hartree
electener: -1544.19974718 hartree
oneelecener: -2443.98304965 hartree
twoeener: 899.78330246 hartree
kineticenergy: 1023.25976423 hartree
xcener: -62.577399496042 hartree
chargesum: -0.0000000
charge: -0.187174 0.740206 -0.334945 -0.527680 -0.337347 -0.251524 -0.116409 0.151532 0.168883 0.107663 0.118038 0.136185 0.114160 0.120780 0.097630
qa: -0.1872 0.7402 -0.3349 -0.5277 -0.3373 -0.2515 -0.1164 0.1515 0.1689 0.1077 0.1180 0.1362 0.1142 0.1208 0.0976
va: 2.2373 5.5123 2.0876 2.0983 3.0837 3.9344 3.8656 1.0364 1.0259 1.0040 1.0006 1.0111 0.9913 0.9960 0.9986
dispcorr: -0.004205916 hartree
energy: -1025.937225248815
dipole: -2.05082 1.70057 -0.35025 -0.64376 0.47787 -0.16589 -0.90766 1.71443 0.80677
magnitude: 0.89502 au
magnitude: 2.27496 debye
