program: Orca
programVersion: 5.0.2
elementType: S P O O N C C H H H H H H H H
charge: 0
multiplicity: 1
keywords: wb97x-d3
keywords: def2-TZVPP
keywords: def2/J RIJCOSX
keywords: DEFGRID2
keywords: scfconv7
keywords: smallprint printgap noloewdin
keywords: NOSOSCF
formula: C2H8NO2PS
InChI: InChI=1/C2H8NO2PS/c1-5-6(3,4)7-2/h3H2,1-2H3
15 atoms
S  -1.212743 -0.805468 0.322853
P  0.432189 0.409338 -0.087166
O  1.604739 -0.693689 -0.003331
O  0.365271 1.199963 -1.330627
N  0.604598 1.337789 1.273545
C  -2.522735 0.404866 -0.02711
C  1.840479 -1.531961 -1.129389
H  1.175431 2.164502 1.189177
H  0.665494 0.891098 2.173775
H  -3.472423 -0.102071 0.127115
H  -2.459489 0.749437 -1.055344
H  -2.456625 1.251587 0.651594
H  1.003933 -2.212936 -1.301166
H  2.730768 -2.116922 -0.910747
H  2.008595 -0.946427 -2.033773
totalener: -1025.93411833 hartree
nucrepener: 518.40945294 hartree
electener: -1544.34357127 hartree
oneelecener: -2444.28845920 hartree
twoeener: 899.94488793 hartree
kineticenergy: 1023.26208695 hartree
xcener: -62.575758342988 hartree
chargesum: 0.0000000
charge: -0.178823 0.738320 -0.345574 -0.526709 -0.330516 -0.248266 -0.115779 0.156957 0.149372 0.116993 0.134483 0.117289 0.099120 0.112955 0.120177
qa: -0.1788 0.7383 -0.3456 -0.5267 -0.3305 -0.2483 -0.1158 0.1570 0.1494 0.1170 0.1345 0.1173 0.0991 0.1130 0.1202
va: 2.2463 5.5131 2.0632 2.1044 3.0836 3.9256 3.8680 1.0331 1.0349 0.9998 1.0089 1.0077 0.9955 0.9909 0.9971
dispcorr: -0.004208493 hartree
energy: -1025.938326822147
dipole: -1.33052 1.39237 0.06186 -0.62153 0.36498 -0.25655 -0.52015 1.37817 0.85802
magnitude: 0.89768 au
magnitude: 2.28173 debye
