program: Orca
programVersion: 5.0.4
elementType: S S P O O O O O N C C C C C C C C C C H H H H H H H H H H H H H H H H H H H H
charge: 0
multiplicity: 1
keywords: wb97x-d3
keywords: def2-TZVPP
keywords: def2/J RIJCOSX
keywords: DEFGRID2
keywords: scfconv7
keywords: smallprint printgap noloewdin
keywords: NOSOSCF
formula: C10H20NO5PS2
InChI: InChI=1/C10H20NO5PS2/c1-5-14-10(13)11(4)9(12)8-19-17(18,15-6-2)16-7-3/h5-8H2,1-4H3
39 atoms
S  -1.403612 -0.047442 -1.555831
S  -0.644566 -1.115648 1.591702
P  -1.994002 -0.386609 0.431912
O  -2.564098 0.997394 0.981235
O  -3.337844 -1.23332 0.234403
O  4.183769 0.135653 0.311849
O  0.171243 2.047951 -0.231415
O  3.063023 -0.434534 -1.533783
N  2.193609 1.074348 -0.026203
C  0.398393 -0.022123 -1.37785
C  0.897818 1.124027 -0.519912
C  -3.623089 1.724988 0.317854
C  -3.36994 -2.675231 0.253684
C  2.570418 2.009062 1.037826
C  3.151071 0.189147 -0.502253
C  -3.327433 3.199146 0.401366
C  -2.770369 -3.304327 -0.979416
C  5.294548 -0.699948 -0.070965
C  6.353298 -0.559131 0.990365
H  0.77098 0.083413 -2.39808
H  0.726285 -0.990023 -1.00681
H  -4.559578 1.477292 0.817865
H  -3.712496 1.419263 -0.727324
H  -4.426396 -2.922808 0.338655
H  -2.86771 -3.029333 1.155865
H  3.443845 2.589316 0.750698
H  2.774501 1.477877 1.964532
H  1.753168 2.696564 1.213863
H  -2.41785 3.453814 -0.141809
H  -3.224868 3.531405 1.434425
H  -4.152616 3.752873 -0.046372
H  -3.235045 -2.930151 -1.891173
H  -2.941336 -4.380326 -0.934122
H  -1.694448 -3.14439 -1.044586
H  5.670474 -0.380999 -1.044238
H  4.956234 -1.733779 -0.153428
H  6.713259 0.466526 1.06838
H  5.990889 -0.879594 1.966938
H  7.200902 -1.190523 0.725737
elementType: S P O N C H
totalener: -1961.98620007 hartree
nucrepener: 2097.80214123 hartree
electener: -4059.78834131 hartree
oneelecener: -6874.81528430 hartree
twoeener: 2815.02694299 hartree
cpcmener: -0.03492950 hartree
kineticenergy: 1956.34683750 hartree
xcener: -132.532481190511 hartree
chargesum: -0.0000000
charge: -0.168678 -0.440217 0.655450 -0.352580 -0.348063 -0.293631 -0.451191 -0.491264 -0.110207 -0.049020 0.268326 0.024178 0.029206 -0.174447 0.524293 -0.235742 -0.243095 0.037252 -0.250860 0.158729 0.131533 0.106895 0.093702 0.109528 0.094337 0.129940 0.119263 0.113301 0.079832 0.091769 0.094231 0.090116 0.103525 0.076443 0.102147 0.103889 0.089823 0.089518 0.091766
qa: -0.1687 -0.4402 0.6555 -0.3526 -0.3481 -0.2936 -0.4512 -0.4913 -0.1102 -0.0490 0.2683 0.0242 0.0292 -0.1744 0.5243 -0.2357 -0.2431 0.0373 -0.2509 0.1587 0.1315 0.1069 0.0937 0.1095 0.0943 0.1299 0.1193 0.1133 0.0798 0.0918 0.0942 0.0901 0.1035 0.0764 0.1021 0.1039 0.0898 0.0895 0.0918
va: 2.2581 2.0162 5.3970 2.0956 2.0881 2.1358 2.0296 2.0071 3.1909 3.8032 4.1232 3.8773 3.8664 3.8511 4.2267 3.9382 3.8890 3.8357 3.9704 1.0116 1.0340 0.9970 0.9932 0.9903 1.0096 0.9960 0.9959 1.0247 1.0149 1.0040 1.0077 1.0046 1.0106 1.0132 0.9971 0.9953 1.0029 1.0031 1.0066
dispcorr: -0.018896031 hartree
energy: -1962.005096104307
dipole: 8.15265 -7.31700 0.83565 -0.25183 -0.26362 -0.51545 1.15003 -1.59824 -0.44821
magnitude: 1.07931 au
magnitude: 2.74338 debye
