program: Orca
programVersion: 5.0.4
elementType: S S P O O O O O N C C C C C C C C C C H H H H H H H H H H H H H H H H H H H H
charge: 0
multiplicity: 1
keywords: wb97x-d3
keywords: def2-TZVPP
keywords: def2/J RIJCOSX
keywords: DEFGRID2
keywords: scfconv7
keywords: smallprint printgap noloewdin
keywords: NOSOSCF
formula: C10H20NO5PS2
InChI: InChI=1/C10H20NO5PS2/c1-5-14-10(13)11(4)9(12)8-19-17(18,15-6-2)16-7-3/h5-8H2,1-4H3
39 atoms
S  -0.049471 -1.383449 -0.467696
S  -2.321494 -1.699149 1.875356
P  -1.696962 -0.525573 0.48589
O  -1.228235 0.943918 0.912493
O  -2.730496 -0.082593 -0.648936
O  3.384748 1.16202 0.215621
O  -0.351056 1.92518 -2.135137
O  2.757243 -0.451079 -1.199693
N  1.522527 1.477693 -0.961785
C  0.123619 -0.365653 -1.968734
C  0.422096 1.092462 -1.711588
C  -0.806063 1.258998 2.256226
C  -3.777372 -0.953833 -1.128493
C  1.562423 2.85056 -0.452829
C  2.57846 0.622721 -0.677207
C  0.5188 0.643464 2.632498
C  -3.269647 -2.119835 -1.939377
C  4.501382 0.383302 0.686113
C  4.084483 -0.610595 1.743278
H  -0.798069 -0.411013 -2.543581
H  0.900072 -0.84764 -2.558515
H  -1.588007 0.954343 2.953436
H  -0.746245 2.345541 2.27284
H  -4.406903 -0.308011 -1.736902
H  -4.368774 -1.296995 -0.278323
H  1.641562 2.860501 0.630853
H  0.646834 3.358306 -0.727713
H  2.397435 3.401027 -0.881364
H  0.783538 0.982344 3.634536
H  1.316849 0.948391 1.959749
H  0.478178 -0.445293 2.654506
H  -2.695761 -2.823823 -1.338124
H  -2.658381 -1.794346 -2.78055
H  -4.128012 -2.657203 -2.343083
H  5.184583 1.122026 1.099203
H  5.000763 -0.101276 -0.152738
H  3.404503 -1.368769 1.356517
H  4.973638 -1.121158 2.113677
H  3.609623 -0.115575 2.590495
elementType: S P O N C H
totalener: -1961.98454027 hartree
nucrepener: 2202.38037173 hartree
electener: -4164.36491200 hartree
oneelecener: -7082.74414133 hartree
twoeener: 2918.37922933 hartree
cpcmener: -0.03582592 hartree
kineticenergy: 1956.36817680 hartree
xcener: -132.541303381681 hartree
chargesum: -0.0000000
charge: -0.145768 -0.443573 0.626329 -0.348580 -0.348934 -0.292867 -0.454900 -0.481230 -0.114132 -0.046978 0.255906 0.031399 0.038174 -0.188644 0.509436 -0.239625 -0.262069 0.038370 -0.266599 0.131187 0.156120 0.105007 0.115409 0.112499 0.097469 0.119049 0.116658 0.141148 0.112199 0.057827 0.084209 0.083120 0.095334 0.108596 0.109703 0.099010 0.088762 0.109464 0.091515
qa: -0.1458 -0.4436 0.6263 -0.3486 -0.3489 -0.2929 -0.4549 -0.4812 -0.1141 -0.0470 0.2559 0.0314 0.0382 -0.1886 0.5094 -0.2396 -0.2621 0.0384 -0.2666 0.1312 0.1561 0.1050 0.1154 0.1125 0.0975 0.1190 0.1167 0.1411 0.1122 0.0578 0.0842 0.0831 0.0953 0.1086 0.1097 0.0990 0.0888 0.1095 0.0915
va: 2.2774 2.0192 5.4282 2.0779 2.0978 2.1316 2.0306 2.0043 3.1681 3.7934 4.1422 3.8295 3.8383 3.8588 4.2287 3.8878 3.8991 3.8378 3.9167 1.0364 1.0197 1.0141 0.9919 0.9922 1.0117 0.9871 1.0214 0.9956 1.0112 1.0136 1.0192 1.0146 1.0001 1.0114 0.9964 1.0096 1.0121 1.0101 0.9997
dispcorr: -0.023737683 hartree
energy: -1962.008277952359
dipole: 9.88385 -8.24006 1.64379 3.24842 -2.37039 0.87803 5.02180 -4.61543 0.40637
magnitude: 1.90738 au
magnitude: 4.84818 debye
