program: Orca
programVersion: 5.0.4
elementType: S S P O O O O O N C C C C C C C C C C H H H H H H H H H H H H H H H H H H H H
charge: 0
multiplicity: 1
keywords: wb97x-d3
keywords: def2-TZVPP
keywords: def2/J RIJCOSX
keywords: DEFGRID2
keywords: scfconv7
keywords: smallprint printgap noloewdin
keywords: NOSOSCF
formula: C10H20NO5PS2
InChI: InChI=1/C10H20NO5PS2/c1-5-14-10(13)11(4)9(12)8-19-17(18,15-6-2)16-7-3/h5-8H2,1-4H3
39 atoms
S  0.332239 0.526101 1.146503
S  -2.057927 -1.476624 2.221351
P  -1.470097 -0.426931 0.720622
O  -2.489664 0.685013 0.179746
O  -1.093558 -1.199572 -0.625051
O  3.087682 0.822521 -0.138107
O  0.03114 1.193155 -2.538853
O  3.521816 -1.208647 -0.962078
N  1.740249 -0.0152 -1.737448
C  0.500299 1.644909 -0.280306
C  0.756772 0.948556 -1.597422
C  -3.397669 1.393326 1.049199
C  -1.959558 -2.188248 -1.229184
C  1.619976 -0.871858 -2.917415
C  2.842008 -0.211629 -0.911366
C  -2.702737 2.37317 1.963113
C  -2.900876 -1.573611 -2.233862
C  4.20469 0.749454 0.772707
C  3.909315 -0.064125 2.009348
H  1.294404 2.342911 -0.022546
H  -0.409731 2.230005 -0.393563
H  -3.979531 0.669495 1.622318
H  -4.075469 1.909661 0.372182
H  -2.50243 -2.72532 -0.448434
H  -1.284101 -2.893643 -1.709979
H  1.884755 -0.329918 -3.823477
H  0.603906 -1.246633 -3.012518
H  2.283068 -1.721585 -2.817168
H  -2.077341 1.875516 2.704134
H  -3.460992 2.941173 2.502803
H  -2.088832 3.081445 1.406321
H  -3.4282 -2.373529 -2.753873
H  -2.360074 -0.989594 -2.978998
H  -3.648334 -0.9360 -1.764018
H  4.393058 1.788186 1.034571
H  5.080619 0.373202 0.244192
H  3.059211 0.335546 2.560892
H  3.71981 -1.113003 1.786552
H  4.779844 -0.017338 2.664387
elementType: S P O N C H
totalener: -1961.98424114 hartree
nucrepener: 2184.43622167 hartree
electener: -4146.42046281 hartree
oneelecener: -7046.70166100 hartree
twoeener: 2900.28119819 hartree
cpcmener: -0.03625036 hartree
kineticenergy: 1956.35010135 hartree
xcener: -132.533459036395 hartree
chargesum: 0.0000000
charge: -0.159005 -0.443351 0.630668 -0.346015 -0.336995 -0.299133 -0.456225 -0.485502 -0.107148 -0.020651 0.235229 0.042215 0.029307 -0.165708 0.492729 -0.252171 -0.244326 0.039990 -0.263583 0.154939 0.131475 0.097566 0.111476 0.094535 0.112305 0.125667 0.103513 0.117916 0.078304 0.106497 0.094788 0.101691 0.087192 0.084158 0.112763 0.103266 0.088110 0.094978 0.108533
qa: -0.1590 -0.4434 0.6307 -0.3460 -0.3370 -0.2991 -0.4562 -0.4855 -0.1071 -0.0207 0.2352 0.0422 0.0293 -0.1657 0.4927 -0.2522 -0.2443 0.0400 -0.2636 0.1549 0.1315 0.0976 0.1115 0.0945 0.1123 0.1257 0.1035 0.1179 0.0783 0.1065 0.0948 0.1017 0.0872 0.0842 0.1128 0.1033 0.0881 0.0950 0.1085
va: 2.2802 2.0303 5.4256 2.0650 2.0971 2.1131 2.0227 2.0227 3.1460 3.7953 4.1685 3.8265 3.8411 3.8791 4.2752 3.9119 3.9328 3.8159 3.9153 1.0148 1.0397 1.0135 0.9917 1.0170 0.9869 0.9923 0.9941 1.0200 1.0158 1.0124 1.0009 1.0090 1.0059 1.0113 0.9962 1.0082 1.0032 1.0130 1.0084
dispcorr: -0.022364248 hartree
energy: -1962.006605387919
dipole: -0.91610 1.04449 0.12839 3.93640 -2.29481 1.64159 -3.31203 3.23713 -0.07491
magnitude: 1.64831 au
magnitude: 4.18966 debye
