program: Orca
programVersion: 5.0.4
elementType: S S P O O O O O N C C C C C C C C C C H H H H H H H H H H H H H H H H H H H H
charge: 0
multiplicity: 1
keywords: wb97x-d3
keywords: def2-TZVPP
keywords: def2/J RIJCOSX
keywords: DEFGRID2
keywords: scfconv7
keywords: smallprint printgap noloewdin
keywords: NOSOSCF
formula: C10H20NO5PS2
InChI: InChI=1/C10H20NO5PS2/c1-5-14-10(13)11(4)9(12)8-19-17(18,15-6-2)16-7-3/h5-8H2,1-4H3
39 atoms
S  0.380399 -1.074867 0.161691
S  -2.417352 -0.661042 2.093072
P  -1.633748 -0.559184 0.336482
O  -1.640712 0.882932 -0.353176
O  -2.267665 -1.497024 -0.79342
O  3.099352 -0.102124 -0.374958
O  0.655712 2.351228 1.556512
O  2.808993 1.132805 -2.210964
N  1.887472 1.792038 -0.230175
C  1.084519 0.041814 1.41302
C  1.209815 1.470017 0.931298
C  -2.828247 1.709734 -0.346619
C  -2.931698 -2.745355 -0.499096
C  1.700333 3.158534 -0.719452
C  2.615451 0.922235 -1.038088
C  -2.419431 3.134223 -0.609511
C  -1.965795 -3.838722 -0.117229
C  3.777863 -1.133067 -1.121709
C  4.049451 -2.276243 -0.179675
H  2.038448 -0.381332 1.720039
H  0.43632 0.047682 2.288964
H  -3.328173 1.622804 0.61984
H  -3.508179 1.343272 -1.117117
H  -3.461474 -2.996326 -1.416034
H  -3.672318 -2.582894 0.28544
H  1.983864 3.873614 0.047758
H  0.664477 3.332228 -1.007185
H  2.331583 3.325461 -1.583154
H  -1.763207 3.511933 0.174215
H  -3.312862 3.75829 -0.627865
H  -1.918429 3.24094 -1.571582
H  -1.472596 -3.637575 0.834195
H  -1.204321 -3.99001 -0.882269
H  -2.518526 -4.772248 -0.008163
H  4.706077 -0.724061 -1.523328
H  3.151392 -1.453091 -1.955705
H  4.594864 -3.050083 -0.719386
H  4.661498 -1.96705 0.667942
H  3.127314 -2.721736 0.195557
elementType: S P O N C H
totalener: -1961.98640924 hartree
nucrepener: 2163.90853238 hartree
electener: -4125.89494162 hartree
oneelecener: -7005.76545460 hartree
twoeener: 2879.87051298 hartree
cpcmener: -0.03547161 hartree
kineticenergy: 1956.35979858 hartree
xcener: -132.532056844888 hartree
chargesum: -0.0000000
charge: -0.158971 -0.449146 0.649397 -0.338004 -0.362774 -0.295139 -0.463523 -0.476964 -0.104393 -0.024247 0.257892 0.033973 0.046028 -0.174036 0.487285 -0.264935 -0.253218 0.014721 -0.246526 0.160503 0.121442 0.092097 0.114353 0.110748 0.096195 0.117628 0.126605 0.112706 0.083145 0.105457 0.093762 0.078172 0.094165 0.104441 0.118939 0.113476 0.101012 0.093752 0.083982
qa: -0.1590 -0.4491 0.6494 -0.3380 -0.3628 -0.2951 -0.4635 -0.4770 -0.1044 -0.0242 0.2579 0.0340 0.0460 -0.1740 0.4873 -0.2649 -0.2532 0.0147 -0.2465 0.1605 0.1214 0.0921 0.1144 0.1107 0.0962 0.1176 0.1266 0.1127 0.0831 0.1055 0.0938 0.0782 0.0942 0.1044 0.1189 0.1135 0.1010 0.0938 0.0840
va: 2.2915 1.9998 5.4246 2.1122 2.0975 2.1104 2.0167 2.0294 3.1607 3.8017 4.1207 3.8359 3.8378 3.8771 4.2857 3.9445 3.8918 3.8151 3.9511 1.0079 1.0551 1.0081 0.9919 0.9919 1.0136 0.9968 0.9889 1.0178 1.0101 1.0089 0.9996 1.0172 1.0027 1.0112 0.9971 0.9978 1.0073 1.0020 1.0062
dispcorr: -0.020952587 hartree
energy: -1962.007361823501
dipole: 2.67674 -2.08261 0.59413 -3.22165 1.77696 -1.44468 -6.26138 5.42975 -0.83163
magnitude: 1.76967 au
magnitude: 4.49814 debye
