program: Orca
programVersion: 5.0.4
elementType: S S P O O O O O N C C C C C C C C C C H H H H H H H H H H H H H H H H H H H H
charge: 0
multiplicity: 1
keywords: wb97x-d3
keywords: def2-TZVPP
keywords: def2/J RIJCOSX
keywords: DEFGRID2
keywords: scfconv7
keywords: smallprint printgap noloewdin
keywords: NOSOSCF
formula: C10H20NO5PS2
InChI: InChI=1/C10H20NO5PS2/c1-5-14-10(13)11(4)9(12)8-19-17(18,15-6-2)16-7-3/h5-8H2,1-4H3
39 atoms
S  0.518678 -1.127606 0.13293
S  -2.21791 -0.449076 2.053345
P  -1.47068 -0.509541 0.279174
O  -1.458161 0.864674 -0.534941
O  -2.136317 -1.512401 -0.773674
O  3.250194 -0.085684 -0.374651
O  0.665995 2.211085 1.592634
O  3.132127 1.344818 -2.080393
N  2.025206 1.796292 -0.138403
C  1.2489 -0.058209 1.410282
C  1.312138 1.388111 0.975906
C  -2.421729 1.914547 -0.293172
C  -2.585787 -2.827205 -0.369218
C  1.780085 3.174538 -0.567054
C  2.832013 1.011884 -0.95894
C  -3.796841 1.557946 -0.798359
C  -4.073099 -2.833091 -0.12492
C  4.021998 -1.017976 -1.159802
C  4.179959 -2.277702 -0.349416
H  2.220047 -0.475686 1.66216
H  0.628427 -0.103549 2.304341
H  -2.02134 2.778368 -0.820715
H  -2.439249 2.147835 0.77251
H  -2.041803 -3.160431 0.517495
H  -2.316445 -3.491217 -1.188986
H  1.994884 3.864873 0.243819
H  0.746328 3.304888 -0.884371
H  2.429023 3.419296 -1.39787
H  -3.785142 1.319086 -1.86145
H  -4.457961 2.412707 -0.653736
H  -4.227167 0.716025 -0.254741
H  -4.388145 -3.8467 0.124468
H  -4.624329 -2.518999 -1.011213
H  -4.344892 -2.183321 0.706212
H  4.990978 -0.569318 -1.384507
H  3.507565 -1.220335 -2.100214
H  3.220532 -2.760617 -0.160139
H  4.797681 -2.978387 -0.910605
H  4.672793 -2.089285 0.604379
elementType: S P O N C H
totalener: -1961.98519997 hartree
nucrepener: 2160.74930899 hartree
electener: -4122.73450896 hartree
oneelecener: -6999.50691206 hartree
twoeener: 2876.77240310 hartree
cpcmener: -0.03544969 hartree
kineticenergy: 1956.36540097 hartree
xcener: -132.534676982458 hartree
chargesum: 0.0000000
charge: -0.169938 -0.443332 0.642240 -0.350395 -0.363493 -0.293260 -0.461392 -0.482765 -0.108638 -0.044052 0.268986 0.041525 0.056206 -0.167997 0.496917 -0.235967 -0.250869 0.022334 -0.253063 0.162094 0.128865 0.112265 0.095006 0.089087 0.111723 0.116244 0.122033 0.113124 0.093451 0.099663 0.074539 0.100450 0.092474 0.078115 0.117192 0.109071 0.085332 0.102336 0.093889
qa: -0.1699 -0.4433 0.6422 -0.3504 -0.3635 -0.2933 -0.4614 -0.4828 -0.1086 -0.0441 0.2690 0.0415 0.0562 -0.1680 0.4969 -0.2360 -0.2509 0.0223 -0.2531 0.1621 0.1289 0.1123 0.0950 0.0891 0.1117 0.1162 0.1220 0.1131 0.0935 0.0997 0.0745 0.1004 0.0925 0.0781 0.1172 0.1091 0.0853 0.1023 0.0939
va: 2.3040 1.9950 5.4418 2.0892 2.0822 2.1149 2.0197 2.0259 3.1809 3.8032 4.0907 3.8226 3.8258 3.8777 4.2719 3.9355 3.9285 3.8190 3.9549 1.0097 1.0540 0.9879 1.0147 1.0109 0.9948 0.9959 0.9908 1.0185 1.0059 1.0086 1.0139 1.0092 1.0025 1.0172 0.9957 0.9992 1.0055 1.0074 1.0016
dispcorr: -0.021001516 hartree
energy: -1962.006201483665
dipole: -4.11720 4.80125 0.68405 -4.48663 3.04415 -1.44248 -6.20212 5.54207 -0.66005
magnitude: 1.72753 au
magnitude: 4.39103 debye
