program: Orca
programVersion: 5.0.4
elementType: S S P O O O O O N C C C C C C C C C C H H H H H H H H H H H H H H H H H H H H
charge: 0
multiplicity: 1
keywords: wb97x-d3
keywords: def2-TZVPP
keywords: def2/J RIJCOSX
keywords: DEFGRID2
keywords: scfconv7
keywords: smallprint printgap noloewdin
keywords: NOSOSCF
formula: C10H20NO5PS2
InChI: InChI=1/C10H20NO5PS2/c1-5-14-10(13)11(4)9(12)8-19-17(18,15-6-2)16-7-3/h5-8H2,1-4H3
39 atoms
S  -1.292256 1.464631 0.874365
S  -4.124888 0.009595 0.187203
P  -2.22495 -0.123471 -0.093694
O  -1.690734 -0.150489 -1.59891
O  -1.472315 -1.456714 0.369748
O  4.088203 -0.575635 -0.58781
O  0.800846 0.096174 2.376628
O  2.773364 1.190848 -0.970858
N  2.412918 -0.201466 0.830221
C  0.434072 1.259126 0.340564
C  1.216576 0.353096 1.269405
C  -2.333613 0.58295 -2.662894
C  -1.705056 -2.006538 1.685933
C  3.040957 -1.232752 1.662176
C  3.074029 0.220493 -0.316065
C  -2.121691 2.074314 -2.57457
C  -2.650098 -3.178142 1.609529
C  4.918339 -0.26083 -1.723933
C  5.906168 0.841953 -1.428968
H  0.868024 2.260318 0.363274
H  0.454926 0.933199 -0.694958
H  -3.397225 0.338424 -2.674016
H  -1.888778 0.183897 -3.572146
H  -2.086629 -1.238689 2.362739
H  -0.729061 -2.314406 2.056079
H  3.118323 -2.17131 1.119056
H  2.432957 -1.400618 2.541331
H  4.029388 -0.918175 1.989245
H  -1.064315 2.329765 -2.500538
H  -2.64841 2.517834 -1.730396
H  -2.512108 2.532604 -3.483785
H  -3.639336 -2.874544 1.268778
H  -2.755128 -3.617203 2.601961
H  -2.271099 -3.951436 0.941299
H  4.293969 -0.025207 -2.585942
H  5.437179 -1.19384 -1.933316
H  5.423845 1.804471 -1.264909
H  6.519503 0.604398 -0.559806
H  6.572876 0.947989 -2.285251
elementType: S P O N C H
totalener: -1961.98696131 hartree
nucrepener: 2095.91714129 hartree
electener: -4057.90410260 hartree
oneelecener: -6869.86144756 hartree
twoeener: 2811.95734497 hartree
cpcmener: -0.03398257 hartree
kineticenergy: 1956.33697814 hartree
xcener: -132.532012415494 hartree
chargesum: -0.0000000
charge: -0.142213 -0.450031 0.618662 -0.351147 -0.350278 -0.297731 -0.452830 -0.496553 -0.121045 -0.058499 0.300376 0.041027 0.054110 -0.177887 0.528572 -0.260015 -0.241527 0.035616 -0.250856 0.159819 0.121792 0.097160 0.112825 0.088346 0.100875 0.121344 0.111820 0.129806 0.094992 0.081787 0.107486 0.075249 0.095399 0.089627 0.095888 0.110577 0.089226 0.089180 0.099050
qa: -0.1422 -0.4500 0.6187 -0.3511 -0.3503 -0.2977 -0.4528 -0.4966 -0.1210 -0.0585 0.3004 0.0410 0.0541 -0.1779 0.5286 -0.2600 -0.2415 0.0356 -0.2509 0.1598 0.1218 0.0972 0.1128 0.0883 0.1009 0.1213 0.1118 0.1298 0.0950 0.0818 0.1075 0.0752 0.0954 0.0896 0.0959 0.1106 0.0892 0.0892 0.0991
va: 2.2980 2.0106 5.4564 2.0919 2.0803 2.1369 2.0408 1.9986 3.2188 3.8252 4.1474 3.8259 3.8280 3.8571 4.2230 3.9066 3.9676 3.8471 3.9154 1.0096 1.0411 1.0136 0.9922 1.0099 0.9941 0.9949 1.0239 0.9948 1.0013 1.0137 1.0112 1.0193 1.0064 1.0042 1.0085 0.9952 1.0138 1.0045 1.0060
dispcorr: -0.019591565 hartree
energy: -1962.006552875782
dipole: 17.55044 -14.25580 3.29464 -5.13633 4.33615 -0.80018 -7.62234 6.27232 -1.35002
magnitude: 3.64932 au
magnitude: 9.27583 debye
