program: Orca
programVersion: 5.0.4
elementType: S S P O O O O O N C C C C C C C C C C H H H H H H H H H H H H H H H H H H H H
charge: 0
multiplicity: 1
keywords: wb97x-d3
keywords: def2-TZVPP
keywords: def2/J RIJCOSX
keywords: DEFGRID2
keywords: scfconv7
keywords: smallprint printgap noloewdin
keywords: NOSOSCF
formula: C10H20NO5PS2
InChI: InChI=1/C10H20NO5PS2/c1-5-14-10(13)11(4)9(12)8-19-17(18,15-6-2)16-7-3/h5-8H2,1-4H3
39 atoms
S  0.250185 -1.18727 0.180817
S  -2.701291 -0.402662 1.732124
P  -1.720188 -0.503321 0.076569
O  -1.527955 0.870251 -0.716499
O  -2.305667 -1.476255 -1.048275
O  3.096483 -0.252449 -0.028548
O  0.578682 2.222604 1.673922
O  2.901683 0.869542 -1.954403
N  1.844232 1.610431 -0.071522
C  0.870743 -0.107999 1.506004
C  1.108308 1.318704 1.060814
C  -2.630798 1.80171 -0.859646
C  -3.129751 -2.622599 -0.748356
C  1.693078 2.965007 -0.602045
C  2.638957 0.719154 -0.786073
C  -2.487866 2.961117 0.092322
C  -2.333168 -3.774824 -0.189833
C  3.843507 -1.319137 -0.648828
C  5.310276 -0.978984 -0.749806
H  1.768381 -0.575508 1.904861
H  0.138197 -0.079513 2.312296
H  -3.584116 1.291002 -0.710988
H  -2.594789 2.135127 -1.8955
H  -3.58756 -2.88844 -1.699319
H  -3.9246 -2.324611 -0.062931
H  0.65058 3.173998 -0.835066
H  2.273025 3.065297 -1.51093
H  2.054025 3.698348 0.115003
H  -2.520692 2.634462 1.131082
H  -3.315391 3.652467 -0.068438
H  -1.560627 3.50869 -0.075951
H  -2.995597 -4.632671 -0.071054
H  -1.913638 -3.546245 0.790266
H  -1.524054 -4.067787 -0.858468
H  3.412983 -1.560686 -1.620544
H  3.689342 -2.172623 0.008471
H  5.843107 -1.840513 -1.152691
H  5.494668 -0.134106 -1.411978
H  5.733375 -0.755842 0.229434
elementType: S P O N C H
totalener: -1961.98431872 hartree
nucrepener: 2164.96350928 hartree
electener: -4126.94782800 hartree
oneelecener: -7008.06988546 hartree
twoeener: 2881.12205746 hartree
cpcmener: -0.03606025 hartree
kineticenergy: 1956.36468501 hartree
xcener: -132.534038927461 hartree
chargesum: 0.0000000
charge: -0.151875 -0.447932 0.648178 -0.350213 -0.362740 -0.303513 -0.458334 -0.477849 -0.100522 -0.025624 0.250092 0.039526 0.046622 -0.174846 0.482684 -0.255337 -0.251715 0.044080 -0.247094 0.156336 0.125206 0.098646 0.111753 0.110935 0.095305 0.121291 0.114879 0.119923 0.078775 0.109180 0.088769 0.103972 0.077886 0.093560 0.104138 0.109996 0.098169 0.086827 0.090867
qa: -0.1519 -0.4479 0.6482 -0.3502 -0.3627 -0.3035 -0.4583 -0.4778 -0.1005 -0.0256 0.2501 0.0395 0.0466 -0.1748 0.4827 -0.2553 -0.2517 0.0441 -0.2471 0.1563 0.1252 0.0986 0.1118 0.1109 0.0953 0.1213 0.1149 0.1199 0.0788 0.1092 0.0888 0.1040 0.0779 0.0936 0.1041 0.1100 0.0982 0.0868 0.0909
va: 2.2958 1.9894 5.4121 2.0865 2.1011 2.1090 2.0222 2.0256 3.1409 3.8040 4.1138 3.8393 3.8376 3.8816 4.2928 3.9194 3.8929 3.8063 3.9453 1.0125 1.0511 1.0083 0.9972 0.9922 1.0144 0.9883 1.0193 0.9935 1.0193 1.0103 1.0028 1.0109 1.0176 1.0033 1.0085 0.9938 1.0062 1.0134 1.0029
dispcorr: -0.021319453 hartree
energy: -1962.005638175167
dipole: 4.97253 -4.37401 0.59852 -0.89464 -0.50250 -1.39714 -5.34546 4.60874 -0.73672
magnitude: 1.68908 au
magnitude: 4.29329 debye
