program: Orca
programVersion: 5.0.4
elementType: S S P O O O O O N C C C C C C C C C C H H H H H H H H H H H H H H H H H H H H
charge: 0
multiplicity: 1
keywords: wb97x-d3
keywords: def2-TZVPP
keywords: def2/J RIJCOSX
keywords: DEFGRID2
keywords: scfconv7
keywords: smallprint printgap noloewdin
keywords: NOSOSCF
formula: C10H20NO5PS2
InChI: InChI=1/C10H20NO5PS2/c1-5-14-10(13)11(4)9(12)8-19-17(18,15-6-2)16-7-3/h5-8H2,1-4H3
39 atoms
S  0.12141 -1.049602 1.143803
S  -2.861173 0.40263 2.034434
P  -1.748935 -0.273503 0.618112
O  -1.313615 0.792201 -0.497628
O  -2.427564 -1.506925 -0.129523
O  3.151221 0.194521 -1.448806
O  0.590998 2.647185 1.291435
O  3.057165 -0.461962 0.687964
N  1.903247 1.388039 -0.046833
C  0.791293 0.41327 1.992483
C  1.102638 1.570296 1.069364
C  -2.133127 1.928236 -0.850244
C  -1.870676 -2.161745 -1.296841
C  1.833436 2.382875 -1.119181
C  2.73314 0.286077 -0.203129
C  -3.39717 1.528846 -1.570566
C  -1.353336 -3.532352 -0.94062
C  4.051431 -0.87735 -1.790542
C  3.314848 -2.170419 -2.040395
H  1.666703 0.075333 2.542619
H  0.061664 0.765445 2.720841
H  -1.49461 2.536852 -1.488065
H  -2.356067 2.499822 0.051964
H  -1.088567 -1.549745 -1.748793
H  -2.688962 -2.229264 -2.012185
H  1.362035 1.965541 -2.006368
H  2.825446 2.747589 -1.373683
H  1.2461 3.227717 -0.782486
H  -3.184595 0.923543 -2.451715
H  -3.913783 2.430365 -1.900845
H  -4.080707 0.978981 -0.923161
H  -1.047337 -4.042006 -1.854383
H  -2.121699 -4.139096 -0.462081
H  -0.48479 -3.48899 -0.282812
H  4.813478 -0.986788 -1.01861
H  4.542372 -0.532138 -2.697974
H  4.030587 -2.921767 -2.374753
H  2.828274 -2.552046 -1.143603
H  2.564811 -2.055294 -2.822681
elementType: S P O N C H
totalener: -1961.98503377 hartree
nucrepener: 2183.40502462 hartree
electener: -4145.39005839 hartree
oneelecener: -7044.66180088 hartree
twoeener: 2899.27174249 hartree
cpcmener: -0.03682205 hartree
kineticenergy: 1956.34636099 hartree
xcener: -132.531767820562 hartree
chargesum: -0.0000000
charge: -0.168592 -0.441684 0.624708 -0.336442 -0.357425 -0.292358 -0.447367 -0.485902 -0.102070 -0.027700 0.236005 0.048098 0.016042 -0.189126 0.507070 -0.246120 -0.231165 0.039273 -0.250279 0.155514 0.125433 0.109434 0.095511 0.105400 0.112823 0.124159 0.135902 0.113550 0.092250 0.104785 0.081685 0.098513 0.093309 0.077286 0.096197 0.110022 0.099560 0.083197 0.090503
qa: -0.1686 -0.4417 0.6247 -0.3364 -0.3574 -0.2924 -0.4474 -0.4859 -0.1021 -0.0277 0.2360 0.0481 0.0160 -0.1891 0.5071 -0.2461 -0.2312 0.0393 -0.2503 0.1555 0.1254 0.1094 0.0955 0.1054 0.1128 0.1242 0.1359 0.1136 0.0922 0.1048 0.0817 0.0985 0.0933 0.0773 0.0962 0.1100 0.0996 0.0832 0.0905
va: 2.2841 2.0166 5.4494 2.0525 2.0881 2.1376 2.0377 1.9975 3.1470 3.7811 4.1320 3.8040 3.8519 3.8524 4.2548 3.9281 3.9438 3.8437 3.9198 1.0163 1.0502 0.9865 1.0171 1.0004 0.9952 0.9919 0.9986 1.0216 1.0048 1.0082 1.0205 1.0065 1.0046 1.0087 1.0090 0.9960 1.0085 1.0134 1.0038
dispcorr: -0.021828188 hartree
energy: -1962.006861957669
dipole: 5.07084 -3.32843 1.74241 -5.81451 5.14400 -0.67052 -22.15828 18.41353 -3.74475
magnitude: 4.18435 au
magnitude: 10.63576 debye
