program: Orca
programVersion: 5.0.4
elementType: S S P O O O O O N C C C C C C C C C C H H H H H H H H H H H H H H H H H H H H
charge: 0
multiplicity: 1
keywords: wb97x-d3
keywords: def2-TZVPP
keywords: def2/J RIJCOSX
keywords: DEFGRID2
keywords: scfconv7
keywords: smallprint printgap noloewdin
keywords: NOSOSCF
formula: C10H20NO5PS2
InChI: InChI=1/C10H20NO5PS2/c1-5-14-10(13)11(4)9(12)8-19-17(18,15-6-2)16-7-3/h5-8H2,1-4H3
39 atoms
S  -0.868425 -0.348622 -1.481489
S  -0.529824 -0.935215 1.851598
P  -1.729559 -0.455776 0.42616
O  -2.479904 0.915746 0.727273
O  -2.975144 -1.42149 0.140054
O  3.508257 0.063111 -0.838691
O  0.200039 2.126172 -0.369886
O  4.334272 0.967227 1.030479
N  2.260133 1.560442 0.285122
C  0.867369 -0.048011 -1.065738
C  1.080078 1.29334 -0.388591
C  -3.310527 1.591386 -0.245318
C  -2.786537 -2.820658 -0.157874
C  2.240846 2.754009 1.132683
C  3.449067 0.838713 0.219153
C  -4.2101 2.546989 0.493745
C  -4.072801 -3.5483 0.130932
C  4.626375 -0.839156 -0.974697
C  4.503431 -2.045572 -0.076349
H  1.384463 -0.075283 -2.025934
H  1.238152 -0.875458 -0.464713
H  -3.903334 0.869527 -0.809319
H  -2.662389 2.120776 -0.944664
H  -1.971372 -3.219606 0.450329
H  -2.506264 -2.922386 -1.2078
H  1.40843 2.710047 1.831092
H  2.155519 3.655781 0.53023
H  3.159061 2.808698 1.703116
H  -4.874079 2.021252 1.179928
H  -4.828378 3.081055 -0.228131
H  -3.638046 3.286075 1.055179
H  -4.343905 -3.479477 1.184354
H  -3.94596 -4.602666 -0.11505
H  -4.896289 -3.162843 -0.470412
H  5.557143 -0.2976 -0.804409
H  4.596299 -1.132911 -2.021565
H  5.321747 -2.730144 -0.301259
H  4.568419 -1.789039 0.980364
H  3.568455 -2.578455 -0.250703
elementType: S P O N C H
totalener: -1961.98703867 hartree
nucrepener: 2103.10508985 hartree
electener: -4065.09212853 hartree
oneelecener: -6884.59562355 hartree
twoeener: 2819.50349502 hartree
cpcmener: -0.03786682 hartree
kineticenergy: 1956.33476664 hartree
xcener: -132.528049604336 hartree
chargesum: 0.0000000
charge: -0.164571 -0.442932 0.649133 -0.347460 -0.351653 -0.296836 -0.455094 -0.489137 -0.110827 -0.057169 0.281402 0.029251 0.041062 -0.162242 0.500757 -0.245719 -0.243700 0.039739 -0.254367 0.162414 0.137642 0.114883 0.094578 0.094077 0.098603 0.113513 0.117845 0.114415 0.088679 0.089230 0.088904 0.087836 0.089029 0.089408 0.102222 0.111619 0.103848 0.091212 0.090407
qa: -0.1646 -0.4429 0.6491 -0.3475 -0.3517 -0.2968 -0.4551 -0.4891 -0.1108 -0.0572 0.2814 0.0293 0.0411 -0.1622 0.5008 -0.2457 -0.2437 0.0397 -0.2544 0.1624 0.1376 0.1149 0.0946 0.0941 0.0986 0.1135 0.1178 0.1144 0.0887 0.0892 0.0889 0.0878 0.0890 0.0894 0.1022 0.1116 0.1038 0.0912 0.0904
va: 2.2710 2.0177 5.4222 2.0988 2.0908 2.1315 2.0191 2.0189 3.2067 3.8274 4.1069 3.8380 3.8434 3.8676 4.2662 3.9681 3.9725 3.8264 3.9231 1.0076 1.0303 0.9906 0.9997 1.0033 0.9960 0.9975 0.9932 1.0205 1.0058 1.0056 1.0035 1.0060 1.0059 1.0032 1.0082 0.9967 1.0072 1.0126 1.0027
dispcorr: -0.018956617 hartree
energy: -1962.005995289169
dipole: -2.61891 2.76173 0.14282 -5.39197 4.02989 -1.36208 -2.59348 0.10870 -2.48478
magnitude: 2.83721 au
magnitude: 7.21162 debye
