program: Orca
programVersion: 5.0.4
elementType: S S P O O O O O N C C C C C C C C C C H H H H H H H H H H H H H H H H H H H H
charge: 0
multiplicity: 1
keywords: wb97x-d3
keywords: def2-TZVPP
keywords: def2/J RIJCOSX
keywords: DEFGRID2
keywords: scfconv7
keywords: smallprint printgap noloewdin
keywords: NOSOSCF
formula: C10H20NO5PS2
InChI: InChI=1/C10H20NO5PS2/c1-5-14-10(13)11(4)9(12)8-19-17(18,15-6-2)16-7-3/h5-8H2,1-4H3
39 atoms
S  -0.24982 1.142098 -0.790651
S  -2.958435 0.975937 1.310149
P  -1.946912 0.140494 -0.102142
O  -2.721209 -0.111062 -1.478475
O  -1.345778 -1.307048 0.213081
O  3.528366 -0.962705 -0.923329
O  0.842092 -0.071301 2.536936
O  2.774265 1.134962 -0.744186
N  2.071649 -0.512679 0.69924
C  0.548644 1.491705 0.80505
C  1.178975 0.266054 1.422688
C  -3.790494 0.735879 -1.94892
C  -2.155015 -2.313571 0.871527
C  2.325227 -1.87665 1.16792
C  2.795312 -0.014764 -0.373665
C  -3.307921 2.08809 -2.411577
C  -1.721693 -2.488344 2.30335
C  4.456926 -0.59008 -1.960666
C  5.727169 -0.00422 -1.392675
H  -0.198482 1.865351 1.50477
H  1.265342 2.290587 0.6321
H  -4.54183 0.83504 -1.163873
H  -4.235076 0.180556 -2.772665
H  -2.009401 -3.228014 0.298249
H  -3.213498 -2.052574 0.813207
H  3.314495 -1.967771 1.612483
H  2.229779 -2.5811 0.34713
H  1.588254 -2.140128 1.916821
H  -2.534436 2.002272 -3.174851
H  -2.923512 2.691861 -1.589403
H  -4.148507 2.627509 -2.848815
H  -2.313292 -3.28472 2.755937
H  -1.880847 -1.579876 2.883035
H  -0.672096 -2.773878 2.37295
H  3.978391 0.087417 -2.667484
H  4.66191 -1.523886 -2.479665
H  6.423509 0.182831 -2.210378
H  5.556055 0.942238 -0.881162
H  6.207121 -0.694367 -0.698921
elementType: S P O N C H
totalener: -1961.98499574 hartree
nucrepener: 2140.92878267 hartree
electener: -4102.91377842 hartree
oneelecener: -6960.59945626 hartree
twoeener: 2857.68567785 hartree
cpcmener: -0.03327697 hartree
kineticenergy: 1956.36453855 hartree
xcener: -132.535164058142 hartree
chargesum: 0.0000000
charge: -0.145295 -0.453307 0.646504 -0.363929 -0.349448 -0.300930 -0.446004 -0.493798 -0.109195 -0.038431 0.254007 0.045544 0.041942 -0.189137 0.522972 -0.254570 -0.253886 0.039106 -0.250651 0.126775 0.155106 0.095406 0.110444 0.110370 0.094657 0.139188 0.124141 0.106909 0.093292 0.079212 0.104237 0.108140 0.077670 0.091022 0.093761 0.110172 0.098574 0.089377 0.090052
qa: -0.1453 -0.4533 0.6465 -0.3639 -0.3494 -0.3009 -0.4460 -0.4938 -0.1092 -0.0384 0.2540 0.0455 0.0419 -0.1891 0.5230 -0.2546 -0.2539 0.0391 -0.2507 0.1268 0.1551 0.0954 0.1104 0.1104 0.0947 0.1392 0.1241 0.1069 0.0933 0.0792 0.1042 0.1081 0.0777 0.0910 0.0938 0.1102 0.0986 0.0894 0.0901
va: 2.2956 1.9862 5.4099 2.0988 2.0861 2.1417 2.0330 1.9903 3.1490 3.7936 4.1018 3.8400 3.8449 3.8745 4.2341 3.8895 3.9205 3.8464 3.9204 1.0521 1.0169 1.0136 0.9919 0.9979 1.0095 0.9940 0.9967 1.0113 1.0031 1.0172 1.0111 1.0110 1.0190 0.9979 1.0104 0.9950 1.0065 1.0125 1.0045
dispcorr: -0.020493011 hartree
energy: -1962.005488753397
dipole: 8.33918 -7.30706 1.03212 -8.00785 6.47584 -1.53201 -4.58357 2.80022 -1.78335
magnitude: 2.56762 au
magnitude: 6.52638 debye
