program: Orca
programVersion: 5.0.4
elementType: S S P O O O O O N C C C C C C C C C C H H H H H H H H H H H H H H H H H H H H
charge: 0
multiplicity: 1
keywords: wb97x-d3
keywords: def2-TZVPP
keywords: def2/J RIJCOSX
keywords: DEFGRID2
keywords: scfconv7
keywords: smallprint printgap noloewdin
keywords: NOSOSCF
formula: C10H20NO5PS2
InChI: InChI=1/C10H20NO5PS2/c1-5-14-10(13)11(4)9(12)8-19-17(18,15-6-2)16-7-3/h5-8H2,1-4H3
39 atoms
S  -0.201006 1.140081 -0.823924
S  -2.974365 1.004499 1.193361
P  -1.882462 0.122687 -0.129185
O  -2.589078 -0.232194 -1.520227
O  -1.244681 -1.279611 0.30146
O  3.415175 -1.027159 -0.813153
O  0.834632 0.203933 2.634574
O  2.799678 1.121303 -0.713478
N  2.061876 -0.404138 0.84058
C  0.545134 1.604397 0.767878
C  1.172229 0.4362 1.493894
C  -3.715443 0.50672 -2.039861
C  -2.035657 -2.265622 1.011222
C  2.291104 -1.738919 1.397242
C  2.767579 -0.008121 -0.285479
C  -3.32263 1.858407 -2.580692
C  -1.643455 -2.315118 2.464311
C  4.275197 -0.778276 -1.942779
C  5.612393 -0.216226 -1.524921
H  -0.226055 2.017575 1.417244
H  1.259292 2.397841 0.560797
H  -4.474474 0.600831 -1.261732
H  -4.118316 -0.126291 -2.828294
H  -1.835698 -3.213625 0.514378
H  -3.100511 -2.053111 0.90126
H  2.059806 -2.50333 0.660012
H  1.639722 -1.88715 2.249261
H  3.319597 -1.854839 1.732482
H  -2.971832 2.528857 -1.795908
H  -4.197766 2.319539 -3.03918
H  -2.549384 1.778497 -3.344669
H  -2.220537 -3.096592 2.958878
H  -1.852319 -1.372557 2.968476
H  -0.587457 -2.555048 2.585643
H  3.770434 -0.132649 -2.661417
H  4.396792 -1.757307 -2.401216
H  6.11364 -0.872121 -0.813384
H  6.248259 -0.135961 -2.406986
H  5.529084 0.777332 -1.086584
elementType: S P O N C H
totalener: -1961.98484389 hartree
nucrepener: 2148.47470236 hartree
electener: -4110.45954625 hartree
oneelecener: -6975.62942344 hartree
twoeener: 2865.16987718 hartree
cpcmener: -0.03314313 hartree
kineticenergy: 1956.36445320 hartree
xcener: -132.535168557733 hartree
chargesum: 0.0000000
charge: -0.142802 -0.452441 0.643575 -0.365596 -0.348425 -0.297745 -0.444308 -0.492865 -0.104460 -0.040621 0.250040 0.047000 0.039937 -0.194987 0.516323 -0.252367 -0.254940 0.038218 -0.249768 0.126749 0.155197 0.095131 0.110920 0.111397 0.095728 0.125301 0.110294 0.140540 0.077895 0.103679 0.093270 0.108774 0.077925 0.091977 0.093922 0.110524 0.089405 0.098802 0.088803
qa: -0.1428 -0.4524 0.6436 -0.3656 -0.3484 -0.2977 -0.4443 -0.4929 -0.1045 -0.0406 0.2500 0.0470 0.0399 -0.1950 0.5163 -0.2524 -0.2549 0.0382 -0.2498 0.1267 0.1552 0.0951 0.1109 0.1114 0.0957 0.1253 0.1103 0.1405 0.0779 0.1037 0.0933 0.1088 0.0779 0.0920 0.0939 0.1105 0.0894 0.0988 0.0888
va: 2.3006 1.9853 5.4104 2.0964 2.0854 2.1417 2.0366 1.9905 3.1384 3.7977 4.1083 3.8373 3.8429 3.8656 4.2426 3.8919 3.9170 3.8470 3.9188 1.0505 1.0167 1.0144 0.9920 0.9982 1.0097 0.9940 1.0147 0.9957 1.0178 1.0109 1.0035 1.0111 1.0195 0.9986 1.0098 0.9950 1.0048 1.0063 1.0132
dispcorr: -0.020761779 hartree
energy: -1962.005605667966
dipole: 7.76604 -6.82548 0.94055 -8.94249 7.18193 -1.76056 -4.55050 2.82840 -1.72210
magnitude: 2.63626 au
magnitude: 6.70083 debye
