program: Orca
programVersion: 5.0.4
elementType: S S P O O O O O N C C C C C C C C C C H H H H H H H H H H H H H H H H H H H H
charge: 0
multiplicity: 1
keywords: wb97x-d3
keywords: def2-TZVPP
keywords: def2/J RIJCOSX
keywords: DEFGRID2
keywords: scfconv7
keywords: smallprint printgap noloewdin
keywords: NOSOSCF
formula: C10H20NO5PS2
InChI: InChI=1/C10H20NO5PS2/c1-5-14-10(13)11(4)9(12)8-19-17(18,15-6-2)16-7-3/h5-8H2,1-4H3
39 atoms
S  -1.205047 -0.319682 -1.870706
S  -0.903552 -1.025471 1.44612
P  -2.062804 -0.416366 0.028537
O  -2.712163 1.029104 0.201418
O  -3.378595 -1.290009 -0.243581
O  4.220009 0.350334 0.496616
O  0.168054 1.907877 -0.583321
O  3.214695 -0.626461 -1.240492
N  2.161365 1.021179 -0.023424
C  0.557769 -0.267266 -1.454343
C  0.937054 0.978915 -0.677863
C  -3.1543 1.509932 1.493832
C  -3.30746 -2.717521 -0.431336
C  2.380366 2.086309 0.959295
C  3.21113 0.167278 -0.329097
C  -2.176756 2.516512 2.043579
C  -4.646763 -3.312065 -0.082487
C  5.412897 -0.429977 0.281184
C  6.378326 -0.093764 1.387261
H  1.066288 -0.28259 -2.419177
H  0.826384 -1.177763 -0.924505
H  -3.291529 0.678901 2.187779
H  -4.130608 1.96064 1.321178
H  -2.522583 -3.135979 0.202595
H  -3.044939 -2.918688 -1.471563
H  1.451584 2.618172 1.122792
H  3.125678 2.798014 0.610147
H  2.69648 1.665438 1.909571
H  -2.570003 2.919832 2.977111
H  -2.0320 3.350059 1.356396
H  -1.209187 2.06203 2.255237
H  -4.900154 -3.136902 0.963057
H  -4.609655 -4.389442 -0.242764
H  -5.442737 -2.909069 -0.708921
H  5.831741 -0.184119 -0.695973
H  5.161219 -1.491299 0.292218
H  5.973373 -0.34949 2.366432
H  7.291551 -0.6703 1.243379
H  6.647467 0.962492 1.383693
elementType: S P O N C H
totalener: -1961.98737997 hartree
nucrepener: 2087.40576691 hartree
electener: -4049.39314688 hartree
oneelecener: -6853.92455294 hartree
twoeener: 2804.53140606 hartree
cpcmener: -0.03458451 hartree
kineticenergy: 1956.35135426 hartree
xcener: -132.531578429638 hartree
chargesum: 0.0000000
charge: -0.146611 -0.458443 0.675854 -0.354826 -0.360696 -0.294688 -0.441525 -0.495915 -0.109772 -0.063039 0.261369 0.050201 0.035810 -0.175791 0.530027 -0.245423 -0.242156 0.032384 -0.250035 0.159872 0.135595 0.088111 0.108134 0.092138 0.099018 0.107940 0.133887 0.120573 0.103080 0.091934 0.070122 0.086421 0.088890 0.089240 0.106300 0.100879 0.089814 0.091290 0.090036
qa: -0.1466 -0.4584 0.6759 -0.3548 -0.3607 -0.2947 -0.4415 -0.4959 -0.1098 -0.0630 0.2614 0.0502 0.0358 -0.1758 0.5300 -0.2454 -0.2422 0.0324 -0.2500 0.1599 0.1356 0.0881 0.1081 0.0921 0.0990 0.1079 0.1339 0.1206 0.1031 0.0919 0.0701 0.0864 0.0889 0.0892 0.1063 0.1009 0.0898 0.0913 0.0900
va: 2.2956 1.9834 5.3756 2.0876 2.1023 2.1386 2.0423 2.0020 3.1892 3.8141 4.1360 3.8514 3.8492 3.8651 4.2212 3.9173 3.9617 3.8410 3.9696 1.0118 1.0368 1.0113 0.9963 1.0049 0.9969 1.0161 0.9942 0.9970 1.0112 1.0039 1.0143 1.0067 1.0062 1.0034 0.9953 0.9962 1.0030 1.0065 1.0029
dispcorr: -0.018661667 hartree
energy: -1962.006041632108
dipole: 8.05588 -6.66780 1.38808 -0.21436 -0.20281 -0.41717 11.91260 -11.00141 0.91119
magnitude: 1.71203 au
magnitude: 4.35163 debye
