program: Orca
programVersion: 5.0.4
elementType: S S P O O O O O N C C C C C C C C C C H H H H H H H H H H H H H H H H H H H H
charge: 0
multiplicity: 1
keywords: wb97x-d3
keywords: def2-TZVPP
keywords: def2/J RIJCOSX
keywords: DEFGRID2
keywords: scfconv7
keywords: smallprint printgap noloewdin
keywords: NOSOSCF
formula: C10H20NO5PS2
InChI: InChI=1/C10H20NO5PS2/c1-5-14-10(13)11(4)9(12)8-19-17(18,15-6-2)16-7-3/h5-8H2,1-4H3
39 atoms
S  0.328234 -1.310717 0.604918
S  -2.631562 -0.12656 1.812445
P  -1.553296 -0.471786 0.254283
O  -1.189639 0.792071 -0.653625
O  -2.129969 -1.500519 -0.82526
O  3.555024 0.793686 -1.186816
O  0.579801 2.147568 1.875958
O  3.287318 -0.506303 0.612706
N  2.030834 1.397484 0.317867
C  0.89831 -0.183522 1.914374
C  1.174388 1.2085 1.392846
C  -2.024979 1.970771 -0.712595
C  -2.735933 -2.748836 -0.413986
C  1.922723 2.642827 -0.445055
C  2.987697 0.462099 -0.044635
C  -3.290599 1.735104 -1.497899
C  -4.23861 -2.654316 -0.457767
C  4.603216 -0.055179 -1.693965
C  4.05617 -1.269832 -2.403558
H  1.768399 -0.644862 2.372452
H  0.124229 -0.103189 2.67619
H  -1.400209 2.723494 -1.190259
H  -2.243922 2.308906 0.301586
H  -2.392147 -3.03074 0.583558
H  -2.365312 -3.497697 -1.112415
H  1.681995 2.434471 -1.484406
H  2.845019 3.216731 -0.393606
H  1.127853 3.248246 -0.029156
H  -3.077058 1.378323 -2.5052
H  -3.833498 2.676826 -1.584177
H  -3.950433 1.01995 -1.005448
H  -4.592728 -2.380033 -1.450604
H  -4.614828 -1.929077 0.262295
H  -4.663116 -3.627153 -0.20915
H  5.283623 -0.329039 -0.887339
H  5.147792 0.58239 -2.38677
H  4.889025 -1.829772 -2.82969
H  3.517872 -1.937603 -1.732138
H  3.392952 -0.987015 -3.220782
elementType: S P O N C H
totalener: -1961.98535007 hartree
nucrepener: 2154.36971842 hartree
electener: -4116.35506848 hartree
oneelecener: -6987.27318208 hartree
twoeener: 2870.91811360 hartree
cpcmener: -0.03258199 hartree
kineticenergy: 1956.36838780 hartree
xcener: -132.535997621585 hartree
chargesum: 0.0000000
charge: -0.153591 -0.446540 0.636371 -0.347048 -0.363001 -0.296723 -0.444037 -0.491960 -0.109815 -0.054093 0.259988 0.041546 0.053374 -0.189136 0.516468 -0.235736 -0.247424 0.038795 -0.249935 0.157211 0.130172 0.111319 0.095936 0.088244 0.112075 0.124955 0.138856 0.109132 0.092726 0.099510 0.075751 0.091446 0.077019 0.099830 0.096511 0.109479 0.098541 0.083762 0.090020
qa: -0.1536 -0.4465 0.6364 -0.3470 -0.3630 -0.2967 -0.4440 -0.4920 -0.1098 -0.0541 0.2600 0.0415 0.0534 -0.1891 0.5165 -0.2357 -0.2474 0.0388 -0.2499 0.1572 0.1302 0.1113 0.0959 0.0882 0.1121 0.1250 0.1389 0.1091 0.0927 0.0995 0.0758 0.0914 0.0770 0.0998 0.0965 0.1095 0.0985 0.0838 0.0900
va: 2.2998 1.9929 5.4308 2.0879 2.0850 2.1400 2.0381 1.9917 3.1538 3.7883 4.0918 3.8180 3.8314 3.8595 4.2434 3.9361 3.9327 3.8460 3.9195 1.0182 1.0499 0.9872 1.0153 1.0102 0.9945 0.9938 0.9962 1.0189 1.0058 1.0080 1.0152 1.0031 1.0178 1.0084 1.0090 0.9960 1.0077 1.0145 1.0041
dispcorr: -0.020730079 hartree
energy: -1962.006080148622
dipole: -2.11015 3.04066 0.93051 -0.11765 -0.05328 -0.17092 -16.15785 13.75659 -2.40126
magnitude: 2.58091 au
magnitude: 6.56016 debye
