program: Orca
programVersion: 5.0.4
elementType: S S P O O O O O N C C C C C C C C C C H H H H H H H H H H H H H H H H H H H H
charge: 0
multiplicity: 1
keywords: wb97x-d3
keywords: def2-TZVPP
keywords: def2/J RIJCOSX
keywords: DEFGRID2
keywords: scfconv7
keywords: smallprint printgap noloewdin
keywords: NOSOSCF
formula: C10H20NO5PS2
InChI: InChI=1/C10H20NO5PS2/c1-5-14-10(13)11(4)9(12)8-19-17(18,15-6-2)16-7-3/h5-8H2,1-4H3
39 atoms
S  -0.016928 -1.415698 0.401901
S  -2.858917 -0.048215 1.729589
P  -1.787989 -0.336376 0.154705
O  -1.241411 0.973853 -0.581554
O  -2.470962 -1.138077 -1.049743
O  3.603911 0.503673 -1.041889
O  0.592435 1.839542 1.991124
O  3.012064 -1.002157 0.495411
N  2.049423 1.091476 0.438418
C  0.668366 -0.503031 1.818364
C  1.114123 0.891592 1.44356
C  -1.935794 2.239269 -0.531833
C  -3.479332 -2.150775 -0.840478
C  2.155713 2.428514 -0.151502
C  2.900397 0.090764 -0.00747
C  -3.225472 2.222001 -1.313401
C  -2.905521 -3.438299 -0.304394
C  4.618063 -0.383483 -1.553795
C  5.286559 0.307896 -2.712406
H  1.472021 -1.112512 2.222872
H  -0.097933 -0.407915 2.586465
H  -1.229734 2.951617 -0.95469
H  -2.10949 2.512935 0.510126
H  -3.923825 -2.300948 -1.822626
H  -4.250796 -1.756679 -0.177057
H  1.44726 3.088463 0.332583
H  1.922932 2.397583 -1.213047
H  3.151681 2.841252 -0.009769
H  -3.066387 1.909736 -2.345217
H  -3.640868 3.229809 -1.329283
H  -3.969639 1.567645 -0.858879
H  -3.698581 -4.185827 -0.268015
H  -2.515223 -3.324768 0.707234
H  -2.11254 -3.824281 -0.94474
H  4.156424 -1.319874 -1.869853
H  5.336233 -0.602605 -0.762055
H  6.065821 -0.344185 -3.105987
H  4.585092 0.513047 -3.520547
H  5.756947 1.24268 -2.408437
elementType: S P O N C H
totalener: -1961.98632794 hartree
nucrepener: 2140.32526612 hartree
electener: -4102.31159406 hartree
oneelecener: -6959.28142867 hartree
twoeener: 2856.96983461 hartree
cpcmener: -0.03299662 hartree
kineticenergy: 1956.36442078 hartree
xcener: -132.535683108108 hartree
chargesum: -0.0000000
charge: -0.149201 -0.448648 0.638518 -0.349257 -0.363724 -0.295304 -0.448390 -0.490709 -0.106358 -0.051030 0.257040 0.038501 0.047585 -0.187564 0.521718 -0.240590 -0.254759 0.034548 -0.252078 0.158618 0.128285 0.111385 0.094363 0.111989 0.095168 0.111152 0.125911 0.135301 0.092336 0.099528 0.079295 0.104187 0.078842 0.094732 0.102236 0.104080 0.091523 0.090450 0.090321
qa: -0.1492 -0.4486 0.6385 -0.3493 -0.3637 -0.2953 -0.4484 -0.4907 -0.1064 -0.0510 0.2570 0.0385 0.0476 -0.1876 0.5217 -0.2406 -0.2548 0.0345 -0.2521 0.1586 0.1283 0.1114 0.0944 0.1120 0.0952 0.1112 0.1259 0.1353 0.0923 0.0995 0.0793 0.1042 0.0788 0.0947 0.1022 0.1041 0.0915 0.0904 0.0903
va: 2.2946 1.9936 5.4140 2.0884 2.0914 2.1380 2.0355 1.9980 3.1625 3.7893 4.1007 3.8252 3.8310 3.8558 4.2335 3.9263 3.8985 3.8393 3.9698 1.0173 1.0508 0.9872 1.0147 0.9915 1.0140 1.0213 0.9934 0.9972 1.0064 1.0077 1.0184 1.0108 1.0170 1.0028 0.9958 0.9961 1.0067 1.0029 1.0026
dispcorr: -0.020151424 hartree
energy: -1962.006479365614
dipole: 4.66908 -3.55656 1.11252 3.23312 -3.10036 0.13277 -15.08946 12.79608 -2.29338
magnitude: 2.55243 au
magnitude: 6.48776 debye
